Azide anion
- Formula: N3-
- Molecular weight: 42.0206
- IUPAC Standard InChIKey: IVRMZWNICZWHMI-UHFFFAOYSA-N
- CAS Registry Number: 14343-69-2
- Chemical structure:
View 3d structure (requires JavaScript / HTML 5) - Other names: Azide, negative ion; Azide; N3

Reaction thermochemistry data

Data compiled as indicated in comments:
B - John E. Bartmess
ALS - Hussein Y. Afeefy, Joel F. Liebman, and Stephen E. Stein
Individual Reactions
Quantity | Value | Units | Method | Reference | Comment |
---|---|---|---|---|---|
ΔrH° | 1428.8 ± 3.0 | kJ/mol | D-EA | Yang, Kiran, et al., 2004 | gas phase; B |
ΔrH° | 1439. ± 13. | kJ/mol | G+TS | Pellerite, Jackson, et al., 1981 | gas phase; Acidity near HCO2H; B |
ΔrH° | 1418. ± 21. | kJ/mol | Acid | Franklin, Dibeler, et al., 1958 | gas phase; From MeN3 and HN3; B |
Quantity | Value | Units | Method | Reference | Comment |
ΔrG° | 1403.9 ± 3.4 | kJ/mol | H-TS | Yang, Kiran, et al., 2004 | gas phase; B |
ΔrG° | 1414. ± 12. | kJ/mol | IMRB | Pellerite, Jackson, et al., 1981 | gas phase; Acidity near HCO2H; B |
+
= H2N3O-
By formula: N3- + H2O = H2N3O-
Quantity | Value | Units | Method | Reference | Comment |
---|---|---|---|---|---|
ΔrH° | 46. ± 75. | kJ/mol | N/A | Yang, Kiran, et al., 2004 | gas phase; Affinity: EA change (H2O)n-1..N3- ion. Vertical Detachment Energy: 3.25±0.03 eV; B |
Quantity | Value | Units | Method | Reference | Comment |
---|---|---|---|---|---|
ΔrH° | 400. ± 8. | kJ/mol | Kin | Okabe and Mele, 1969 | gas phase; Photodissociation; ALS |

Gas phase ion energetics data

Data compiled by: John E. Bartmess
Protonation reactions
Quantity | Value | Units | Method | Reference | Comment |
---|---|---|---|---|---|
ΔrH° | 1428.8 ± 3.0 | kJ/mol | D-EA | Yang, Kiran, et al., 2004 | gas phase |
ΔrH° | 1439. ± 13. | kJ/mol | G+TS | Pellerite, Jackson, et al., 1981 | gas phase; Acidity near HCO2H |
ΔrH° | 1418. ± 21. | kJ/mol | Acid | Franklin, Dibeler, et al., 1958 | gas phase; From MeN3 and HN3 |
Quantity | Value | Units | Method | Reference | Comment |
ΔrG° | 1403.9 ± 3.4 | kJ/mol | H-TS | Yang, Kiran, et al., 2004 | gas phase |
ΔrG° | 1414. ± 12. | kJ/mol | IMRB | Pellerite, Jackson, et al., 1981 | gas phase; Acidity near HCO2H |

Ion clustering data

Data compiled by: John E. Bartmess
Clustering reactions
+
= H2N3O-
By formula: N3- + H2O = H2N3O-
Quantity | Value | Units | Method | Reference | Comment |
---|---|---|---|---|---|
ΔrH° | 46. ± 75. | kJ/mol | N/A | Yang, Kiran, et al., 2004 | gas phase; Affinity: EA change (H2O)n-1..N3- ion. Vertical Detachment Energy: 3.25±0.03 eV |

Vibrational and/or electronic energy levels

Data compiled by: Marilyn E. Jacox
State: ?
Energy (cm-1) |
Med. | Transition | λmin (nm) |
λmax (nm) |
References | ||
---|---|---|---|---|---|---|---|
Td = 21620 ± 80 | gas | Illenberger, Comita, et al., 1985 | |||||
Continetti, Cyr, et al., 1991 | |||||||
State: X
Vib. sym. |
No. | Approximate type of mode |
cm-1 | Med. | Method | References | |
---|---|---|---|---|---|---|---|
Σu+ | 3 | Asym. stretch | 1986.47 | gas | DL | Polak, Gruebele, et al., 1987 Polak, Gruebele, et al., 1988 | |
3 | Asym. stretch | 1991.9 | Ar | IR | Zhou and Andrews, 2000 | ||
3 | Asym. stretch | 2002.9 | N2 | IR | Tian, Facelli, et al., 1988 Zhou and Andrews, 2000 | ||
Additional references: Jacox, 1994, page 87; Jacox, 2003, page 132

References

Yang, Kiran, et al., 2004
Yang, X.; Kiran, B.; Wang, X.B.; Wang, L.S.; Mucha, M.; Jungwirth, P.,
Solvation of the azide anion (N-3(-)) in water clusters and aqueous interfaces: A combined investigation by photoelectron spectroscopy, density functional calculations, and molecular dynamic,
J. Phys. Chem. A, 2004, 108, 39, 7820-7826, https://doi.org/10.1021/jp0496396
. [all data]
Pellerite, Jackson, et al., 1981
Pellerite, M.J.; Jackson, R.L.; Brauman, J.I.,
Proton affinity of the gaseous azide Ion. The N-H bond dissociation enegry in HN3,
J. Phys. Chem., 1981, 85, 1624. [all data]
Franklin, Dibeler, et al., 1958
Franklin, J.L.; Dibeler, V.H.; Reese, R.M.; Krauss, M.,
Ionization and dissociation of hydrazoic acid and methyl azide by electron impact,
J. Am. Chem. Soc., 1958, 80, 298. [all data]
Okabe and Mele, 1969
Okabe, H.; Mele, A.,
Photodissociation of NCN3 in the vacuum-ultraviolet production of CN B2Σ and NCN A3II,
J. Chem. Phys., 1969, 51, 2100-2106. [all data]