Silicon anion
- Formula: Si-
- Molecular weight: 28.0860
- CAS Registry Number: 14337-02-1

Gas phase thermochemistry data

Data compiled as indicated in comments:
B - John E. Bartmess
Quantity | Value | Units | Method | Reference | Comment |
---|---|---|---|---|---|
ΔfH°gas | 316. ± 14. | kJ/mol | Acid | Blondel, Chaibi, et al., 2005 | (28)Si: 1.3895213(13) eV; revised analysis of Blondel, Delsart, et al., 2001; B |
Quantity | Value | Units | Method | Reference | Comment |
S°gas,1 bar | 161.98 | J/mol*K | Review | Chase, 1998 | Data last reviewed in March, 1983 |

Gas phase ion energetics data

Data compiled by: John E. Bartmess
Protonation reactions
Quantity | Value | Units | Method | Reference | Comment |
---|---|---|---|---|---|
ΔrH° | 1477. ± 11. | kJ/mol | D-EA | Blondel, Chaibi, et al., 2005 | gas phase; (28)Si: 1.3895213(13) eV; revised analysis of Blondel, Delsart, et al., 2001 |
Quantity | Value | Units | Method | Reference | Comment |
ΔrG° | 1456. ± 12. | kJ/mol | H-TS | Blondel, Chaibi, et al., 2005 | gas phase; (28)Si: 1.3895213(13) eV; revised analysis of Blondel, Delsart, et al., 2001 |

Reaction thermochemistry data

Data compiled by: John E. Bartmess

Individual Reactions

Si- + Hydrogen cation = Silylidyne

By formula: Si- + H+ = HSi

Quantity Value Units Method Reference Comment
Δr1477. ± 11.kJ/molD-EABlondel, Chaibi, et al., 2005gas phase; (28)Si: 1.3895213(13) eV; revised analysis of Blondel, Delsart, et al., 2001
Quantity Value Units Method Reference Comment
Δr1456. ± 12.kJ/molH-TSBlondel, Chaibi, et al., 2005gas phase; (28)Si: 1.3895213(13) eV; revised analysis of Blondel, Delsart, et al., 2001

References

Blondel, Chaibi, et al., 2005
Blondel, C.; Chaibi, W.; Delsart, C.; Drag, C.; Goldfarb, F.; Kroger, S.,
The electron affinities of O, Si, and S revisited with the photodetachment microscope,
Eur. Phys. J. D, 2005, 33, 3, 335-342, https://doi.org/10.1140/epjd/e2005-00069-9
. [all data]
Blondel, Delsart, et al., 2001
Blondel, C.; Delsart, C.; Goldfarb, F.,
Electron spectrometry at the mu eV level and the electron affinities of Si and F,
J. Phys. B: Atom. Mol. Opt. Phys., 2001, 34, 9, L281-L288, https://doi.org/10.1088/0953-4075/34/9/101
. [all data]
Chase, 1998
Chase, M.W., Jr.,
NIST-JANAF Themochemical Tables, Fourth Edition,
J. Phys. Chem. Ref. Data, Monograph 9, 1998, 1-1951. [all data]