Carbon anion
- Formula: C-
- Molecular weight: 12.0112
- IUPAC Standard InChIKey: LGRLWUINFJPLSH-UHFFFAOYSA-N
- CAS Registry Number: 14337-00-9
- Chemical structure:
View 3d structure (requires JavaScript / HTML 5) - Species with the same structure:

Gas phase thermochemistry data

Data compiled as indicated in comments:
B - John E. Bartmess
Quantity | Value | Units | Method | Reference | Comment |
---|---|---|---|---|---|
ΔfH°gas | 595.1 ± 1.1 | kJ/mol | Acid | Scheer, Bilodeau, et al., 1998 | Given: 1.262119(20) eV; B |
Quantity | Value | Units | Method | Reference | Comment |
S°gas,1 bar | 151.38 | J/mol*K | Review | Chase, 1998 | Data last reviewed in March, 1983 |

Reaction thermochemistry data

Data compiled as indicated in comments:
B - John E. Bartmess
M - Michael M. Meot-Ner (Mautner) and Sharon G. Lias
Individual Reactions
Quantity | Value | Units | Method | Reference | Comment |
---|---|---|---|---|---|
ΔrH° | 1529.4 ± 0.71 | kJ/mol | D-EA | Scheer, Bilodeau, et al., 1998 | gas phase; Given: 1.262119(20) eV; B |
Quantity | Value | Units | Method | Reference | Comment |
ΔrG° | 1506.2 ± 1.1 | kJ/mol | H-TS | Scheer, Bilodeau, et al., 1998 | gas phase; Given: 1.262119(20) eV; B |
By formula: (C- • 2C) + C = (C- • 3C)
Quantity | Value | Units | Method | Reference | Comment |
---|---|---|---|---|---|
ΔrH° | 703. ± 8. | kJ/mol | MS | Pargellis, 1990 | gas phase; equilibrium cluster distributions from sputtering; M |
By formula: (C- • 3C) + C = (C- • 4C)
Quantity | Value | Units | Method | Reference | Comment |
---|---|---|---|---|---|
ΔrH° | 630. ± 20. | kJ/mol | MS | Pargellis, 1990 | gas phase; equilibrium cluster distributions from sputtering; M |
By formula: (C- • C) + C = (C- • 2C)
Quantity | Value | Units | Method | Reference | Comment |
---|---|---|---|---|---|
ΔrH° | 628. ± 8. | kJ/mol | MS | Pargellis, 1990 | gas phase; equilibrium cluster distributions from sputtering; M |
By formula: (C- • 4C) + C = (C- • 5C)
Quantity | Value | Units | Method | Reference | Comment |
---|---|---|---|---|---|
ΔrH° | 715. | kJ/mol | MS | Pargellis, 1990 | gas phase; equilibrium cluster distributions from sputtering; M |
By formula: (C- • 5C) + C = (C- • 6C)
Quantity | Value | Units | Method | Reference | Comment |
---|---|---|---|---|---|
ΔrH° | 649. | kJ/mol | MS | Pargellis, 1990 | gas phase; equilibrium cluster distributions from sputtering; M |
By formula: (C- • 6C) + C = (C- • 7C)
Quantity | Value | Units | Method | Reference | Comment |
---|---|---|---|---|---|
ΔrH° | 686. | kJ/mol | MS | Pargellis, 1990 | gas phase; equilibrium cluster distributions from sputtering; M |
By formula: (C- • 7C) + C = (C- • 8C)
Quantity | Value | Units | Method | Reference | Comment |
---|---|---|---|---|---|
ΔrH° | 657. | kJ/mol | MS | Pargellis, 1990 | gas phase; equilibrium cluster distributions from sputtering; M |
By formula: (C- • 8C) + C = (C- • 9C)
Quantity | Value | Units | Method | Reference | Comment |
---|---|---|---|---|---|
ΔrH° | 665. | kJ/mol | MS | Pargellis, 1990 | gas phase; equilibrium cluster distributions from sputtering; M |
Quantity | Value | Units | Method | Reference | Comment |
---|---|---|---|---|---|
ΔrH° | 812. ± 8. | kJ/mol | MS | Pargellis, 1990 | gas phase; equilibrium cluster distributions from sputtering; M |

Gas phase ion energetics data

Data compiled by: John E. Bartmess
Protonation reactions
Quantity | Value | Units | Method | Reference | Comment |
---|---|---|---|---|---|
ΔrH° | 1529.4 ± 0.71 | kJ/mol | D-EA | Scheer, Bilodeau, et al., 1998 | gas phase; Given: 1.262119(20) eV |
Quantity | Value | Units | Method | Reference | Comment |
ΔrG° | 1506.2 ± 1.1 | kJ/mol | H-TS | Scheer, Bilodeau, et al., 1998 | gas phase; Given: 1.262119(20) eV |

Ion clustering data

Data compiled by: Michael M. Meot-Ner (Mautner) and Sharon G. Lias
Clustering reactions
Quantity | Value | Units | Method | Reference | Comment |
---|---|---|---|---|---|
ΔrH° | 812. ± 8. | kJ/mol | MS | Pargellis, 1990 | gas phase; equilibrium cluster distributions from sputtering |
By formula: (C- • C) + C = (C- • 2C)
Quantity | Value | Units | Method | Reference | Comment |
---|---|---|---|---|---|
ΔrH° | 628. ± 8. | kJ/mol | MS | Pargellis, 1990 | gas phase; equilibrium cluster distributions from sputtering |
By formula: (C- • 2C) + C = (C- • 3C)
Quantity | Value | Units | Method | Reference | Comment |
---|---|---|---|---|---|
ΔrH° | 703. ± 8. | kJ/mol | MS | Pargellis, 1990 | gas phase; equilibrium cluster distributions from sputtering |
By formula: (C- • 3C) + C = (C- • 4C)
Quantity | Value | Units | Method | Reference | Comment |
---|---|---|---|---|---|
ΔrH° | 630. ± 20. | kJ/mol | MS | Pargellis, 1990 | gas phase; equilibrium cluster distributions from sputtering |
By formula: (C- • 4C) + C = (C- • 5C)
Quantity | Value | Units | Method | Reference | Comment |
---|---|---|---|---|---|
ΔrH° | 715. | kJ/mol | MS | Pargellis, 1990 | gas phase; equilibrium cluster distributions from sputtering |
By formula: (C- • 5C) + C = (C- • 6C)
Quantity | Value | Units | Method | Reference | Comment |
---|---|---|---|---|---|
ΔrH° | 649. | kJ/mol | MS | Pargellis, 1990 | gas phase; equilibrium cluster distributions from sputtering |
By formula: (C- • 6C) + C = (C- • 7C)
Quantity | Value | Units | Method | Reference | Comment |
---|---|---|---|---|---|
ΔrH° | 686. | kJ/mol | MS | Pargellis, 1990 | gas phase; equilibrium cluster distributions from sputtering |
By formula: (C- • 7C) + C = (C- • 8C)
Quantity | Value | Units | Method | Reference | Comment |
---|---|---|---|---|---|
ΔrH° | 657. | kJ/mol | MS | Pargellis, 1990 | gas phase; equilibrium cluster distributions from sputtering |
By formula: (C- • 8C) + C = (C- • 9C)
Quantity | Value | Units | Method | Reference | Comment |
---|---|---|---|---|---|
ΔrH° | 665. | kJ/mol | MS | Pargellis, 1990 | gas phase; equilibrium cluster distributions from sputtering |

References

Scheer, Bilodeau, et al., 1998
Scheer, M.; Bilodeau, R.C.; Brodie, C.A.; Haugen, H.K.,
Systematic study of the stable states of C-, Si-, Ge-, and Sn- via infrared laser spectroscopy,
Phys. Rev. A, 1998, 58, 4, 2844-2856, https://doi.org/10.1103/PhysRevA.58.2844
. [all data]
Chase, 1998
Chase, M.W., Jr.,
NIST-JANAF Themochemical Tables, Fourth Edition,
J. Phys. Chem. Ref. Data, Monograph 9, 1998, 1-1951. [all data]
Pargellis, 1990
Pargellis, A.N.,
Estimating Carbon Cluster Binding Energies from Measured Cn Distributions, n <= 10,
J. Chem. Phys., 1990, 93, 3, 2099, https://doi.org/10.1063/1.459035
. [all data]