Scandium ion (1+)
- Formula: Sc+
- Molecular weight: 44.955363
- IUPAC Standard InChIKey: MHBCCBGBYYHDBC-UHFFFAOYSA-N
- CAS Registry Number: 14336-93-7
- Chemical structure:
View 3d structure (requires JavaScript / HTML 5) - Permanent link for this species. Use this link for bookmarking this species for future reference.

Reaction thermochemistry data

Data compiled as indicated in comments:
M - Michael M. Meot-Ner (Mautner) and Sharon G. Lias
RCD - Robert C. Dunbar
Individual Reactions
By formula: Sc+ + C2H4 = (Sc+ • C2H4)
Quantity | Value | Units | Method | Reference | Comment |
---|---|---|---|---|---|
ΔrH° | 220. ± 10. | kJ/mol | PDiss | Ranashinge and Freiser, 1992 | gas phase; M |
Enthalpy of reaction
ΔrH° (kJ/mol) | T (K) | Method | Reference | Comment |
---|---|---|---|---|
131. | CID | Armentrout and Kickel, 1994 | gas phase; ΔrH >=, guided ion beam CID; M |
By formula: Sc+ + C2H2 = (Sc+ • C2H2)
Enthalpy of reaction
ΔrH° (kJ/mol) | T (K) | Method | Reference | Comment |
---|---|---|---|---|
240. (+20.,-0.) | CID | Armentrout and Kickel, 1994 | gas phase; guided ion beam CID; M |
By formula: Sc+ + H2O = (Sc+ • H2O)
Quantity | Value | Units | Method | Reference | Comment |
---|---|---|---|---|---|
ΔrH° | 130. ± 10. | kJ/mol | CID | Magnera, David, et al., 1989 | gas phase; M |
By formula: Sc+ + CH2 = (Sc+ • CH2)
Quantity | Value | Units | Method | Reference | Comment |
---|---|---|---|---|---|
ΔrH° | 411. ± 22. | kJ/mol | CIDT | Sunderlin and Armentrout, 1989 | RCD |
By formula: Sc+ + C5H5N = (Sc+ • C5H5N)
Quantity | Value | Units | Method | Reference | Comment |
---|---|---|---|---|---|
ΔrH° | 231. ± 10. | kJ/mol | CIDT | Rodgers, Stanley, et al., 2000 | RCD |
By formula: Sc+ + CS = (Sc+ • CS)
Quantity | Value | Units | Method | Reference | Comment |
---|---|---|---|---|---|
ΔrH° | 133. ± 7.9 | kJ/mol | CIDT | Rodgers and Armentrout, 2000 | RCD |
By formula: Sc+ + C4H4N2 = (Sc+ • C4H4N2)
Quantity | Value | Units | Method | Reference | Comment |
---|---|---|---|---|---|
ΔrH° | 214. ± 9.2 | kJ/mol | CIDT | Amunugama and Rodgers, 2001 | RCD |

Ion clustering data

Data compiled as indicated in comments:
RCD - Robert C. Dunbar
M - Michael M. Meot-Ner (Mautner) and Sharon G. Lias
Clustering reactions
By formula: Sc+ + CH2 = (Sc+ • CH2)
Quantity | Value | Units | Method | Reference | Comment |
---|---|---|---|---|---|
ΔrH° | 411. ± 22. | kJ/mol | CIDT | Sunderlin and Armentrout, 1989 | RCD |
By formula: Sc+ + CS = (Sc+ • CS)
Quantity | Value | Units | Method | Reference | Comment |
---|---|---|---|---|---|
ΔrH° | 133. ± 7.9 | kJ/mol | CIDT | Rodgers and Armentrout, 2000 | RCD |
By formula: Sc+ + C2H2 = (Sc+ • C2H2)
Enthalpy of reaction
ΔrH° (kJ/mol) | T (K) | Method | Reference | Comment |
---|---|---|---|---|
240. (+20.,-0.) | CID | Armentrout and Kickel, 1994 | gas phase; guided ion beam CID; M |
By formula: Sc+ + C2H4 = (Sc+ • C2H4)
Quantity | Value | Units | Method | Reference | Comment |
---|---|---|---|---|---|
ΔrH° | 220. ± 10. | kJ/mol | PDiss | Ranashinge and Freiser, 1992 | gas phase; M |
Enthalpy of reaction
ΔrH° (kJ/mol) | T (K) | Method | Reference | Comment |
---|---|---|---|---|
131. | CID | Armentrout and Kickel, 1994 | gas phase; ΔrH >=, guided ion beam CID; M |
By formula: Sc+ + C4H4N2 = (Sc+ • C4H4N2)
Quantity | Value | Units | Method | Reference | Comment |
---|---|---|---|---|---|
ΔrH° | 214. ± 9.2 | kJ/mol | CIDT | Amunugama and Rodgers, 2001 | RCD |
By formula: Sc+ + C5H5N = (Sc+ • C5H5N)
Quantity | Value | Units | Method | Reference | Comment |
---|---|---|---|---|---|
ΔrH° | 231. ± 10. | kJ/mol | CIDT | Rodgers, Stanley, et al., 2000 | RCD |
By formula: Sc+ + H2O = (Sc+ • H2O)
Quantity | Value | Units | Method | Reference | Comment |
---|---|---|---|---|---|
ΔrH° | 130. ± 10. | kJ/mol | CID | Magnera, David, et al., 1989 | gas phase; M |

References

Ranashinge and Freiser, 1992
Ranashinge, Y.A.; Freiser, B.S.,
Gas-Phase Photodissociation of MC2H2+ (M = Sc, Y, La). Determination of D0(M+ - C2H2),
Chem. Phys. Let., 1992, 200, 1-2, 135, https://doi.org/10.1016/0009-2614(92)87058-W
. [all data]
Armentrout and Kickel, 1994
Armentrout, P.B.; Kickel, B.L.,
Gas Phase Thermochemistry of Transition Metal Ligand Systems: Reassessment of Values and Periodic Trends, in Organometallic Ion Chemistry, B. S. Freiser, ed, 1994. [all data]
Magnera, David, et al., 1989
Magnera, T.F.; David, D.E.; Michl, J.,
Gas -Phase Water and Hydroxyl Binding Energies for Monopoisitive First - Row Transition - Metal Ions,
J. Am. Chem. Soc., 1989, 111, 11, 4101, https://doi.org/10.1021/ja00193a051
. [all data]
Sunderlin and Armentrout, 1989
Sunderlin, L.S.; Armentrout, P.B.,
Periodic Trends in Chemical Reactivity: Reactions of Sc+, Y+, La+, and Lu+ with Methane and Ethane,
J. Am. Chem. Soc., 1989, 111, 11, 3845, https://doi.org/10.1021/ja00193a015
. [all data]
Rodgers, Stanley, et al., 2000
Rodgers, M.T.; Stanley, J.R.; Amunugama, R.,
Periodic Trends in the Binding of Metal Ions to Pyridine Studied by Threshold Collision-Induced Dissociation and Density Functional Theory,
J. Am. Chem. Soc., 2000, 122, 44, 10969, https://doi.org/10.1021/ja0027923
. [all data]
Rodgers and Armentrout, 2000
Rodgers, M.T.; Armentrout, P.B.,
Noncovalent Metal-Ligand Bond Energies as Studied by Threshold Collision-Induced Dissociation,
Mass Spectrom. Rev., 2000, 19, 4, 215, https://doi.org/10.1002/1098-2787(200007)19:4<215::AID-MAS2>3.0.CO;2-X
. [all data]
Amunugama and Rodgers, 2001
Amunugama, R.; Rodgers, M.T.,
Periodic Trends in the Binding of Metal Ions to Pyrimidine Studied by Threshold Collision-Induced Dissociation and Density Functional Theory,
J. Phys. Chem. A, 2001, 105, 43, 9883, https://doi.org/10.1021/jp010663i
. [all data]