sodium cyanide

Condensed phase thermochemistry data

Quantity Value Units Method Reference Comment
Δfliquid-84.40kJ/molReviewChase, 1998Data last reviewed in March, 1966
Quantity Value Units Method Reference Comment
liquid,1 bar125.60J/mol*KReviewChase, 1998Data last reviewed in March, 1966
Quantity Value Units Method Reference Comment
Δfsolid-90.71kJ/molReviewChase, 1998Data last reviewed in March, 1966
Quantity Value Units Method Reference Comment
solid118.49J/mol*KReviewChase, 1998Data last reviewed in March, 1966

Liquid Phase Heat Capacity (Shomate Equation)

Cp° = A + B*t + C*t2 + D*t3 + E/t2
H° − H°298.15= A*t + B*t2/2 + C*t3/3 + D*t4/4 − E/t + F − H
S° = A*ln(t) + B*t + C*t2/2 + D*t3/3 − E/(2*t2) + G
    Cp = heat capacity (J/mol*K)
    H° = standard enthalpy (kJ/mol)
    S° = standard entropy (J/mol*K)
    t = temperature (K) / 1000.

View plot Requires a JavaScript / HTML 5 canvas capable browser.

View table.

Temperature (K) 835. - 3000.
A 79.49600
B 0.000000
C 0.000000
D 0.000000
E 0.000000
F -111.3475
G 214.1819
H -84.39797
ReferenceChase, 1998
Comment Data last reviewed in March, 1966

Solid Phase Heat Capacity (Shomate Equation)

Cp° = A + B*t + C*t2 + D*t3 + E/t2
H° − H°298.15= A*t + B*t2/2 + C*t3/3 + D*t4/4 − E/t + F − H
S° = A*ln(t) + B*t + C*t2/2 + D*t3/3 − E/(2*t2) + G
    Cp = heat capacity (J/mol*K)
    H° = standard enthalpy (kJ/mol)
    S° = standard entropy (J/mol*K)
    t = temperature (K) / 1000.

View plot Requires a JavaScript / HTML 5 canvas capable browser.

View table.

Temperature (K) 298. - 835.
A 68.14732
B 1.091197
C 0.010951
D -0.010567
E 0.013628
F -111.0241
G 200.7065
H -90.70912
ReferenceChase, 1998
Comment Data last reviewed in March, 1966

References

Chase, 1998
Chase, M.W., Jr., NIST-JANAF Themochemical Tables, Fourth Edition, J. Phys. Chem. Ref. Data, Monograph 9, 1998, 1-1951. [all data]