Magnesium monohydride
- Formula: HMg
- Molecular weight: 25.3129
- IUPAC Standard InChIKey: RZCHRULKKYOSQS-UHFFFAOYSA-N
- CAS Registry Number: 14332-53-7
- Chemical structure:
View 3d structure (requires JavaScript / HTML 5) - Permanent link for this species. Use this link for bookmarking this species for future reference.

Gas phase thermochemistry data

Quantity | Value | Units | Method | Reference | Comment |
---|---|---|---|---|---|
ΔfH°gas | 169.03 | kJ/mol | Review | Chase, 1998 | Data last reviewed in December, 1966 |
Quantity | Value | Units | Method | Reference | Comment |
S°gas,1 bar | 193.20 | J/mol*K | Review | Chase, 1998 | Data last reviewed in December, 1966 |
Gas Phase Heat Capacity (Shomate Equation)
Cp° = A + B*t + C*t2 + D*t3 +
E/t2
H° − H°298.15= A*t + B*t2/2 +
C*t3/3 + D*t4/4 − E/t + F − H
S° = A*ln(t) + B*t + C*t2/2 + D*t3/3 −
E/(2*t2) + G
Cp = heat capacity (J/mol*K)
H° = standard enthalpy (kJ/mol)
S° = standard entropy (J/mol*K)
t = temperature (K) / 1000.
View plot Requires a JavaScript / HTML 5 canvas capable browser.
Temperature (K) | 298. to 1200. | 1200. to 6000. |
---|---|---|
A | 19.51171 | 39.71566 |
B | 32.34282 | -1.024759 |
C | -21.96064 | 0.417702 |
D | 5.602962 | -0.011593 |
E | 0.198716 | -3.746781 |
F | 162.6292 | 149.1387 |
G | 209.2155 | 231.3216 |
H | 169.0340 | 169.0340 |
Reference | Chase, 1998 | Chase, 1998 |
Comment | Data last reviewed in December, 1966 | Data last reviewed in December, 1966 |

Gas phase ion energetics data

Data compiled by: John E. Bartmess
Electron affinity determinations
EA (eV) | Method | Reference | Comment |
---|---|---|---|
1.050 ± 0.060 | PD | Rackwitz, Feldman, et al., 1977 | Caln: ΔHacid=363.8 Hinde, 2000 |

Constants of diatomic molecules

Data compiled by: Klaus P. Huber and Gerhard H. Herzberg
Data collected through March, 1977
Symbol | Meaning |
---|---|
State | electronic state and / or symmetry symbol |
Te | minimum electronic energy (cm-1) |
ωe | vibrational constant – first term (cm-1) |
ωexe | vibrational constant – second term (cm-1) |
ωeye | vibrational constant – third term (cm-1) |
Be | rotational constant in equilibrium position (cm-1) |
αe | rotational constant – first term (cm-1) |
γe | rotation-vibration interaction constant (cm-1) |
De | centrifugal distortion constant (cm-1) |
βe | rotational constant – first term, centrifugal force (cm-1) |
re | internuclear distance (Å) |
Trans. | observed transition(s) corresponding to electronic state |
ν00 | position of 0-0 band (units noted in table) |
State | Te | ωe | ωexe | ωeye | Be | αe | γe | De | βe | re | Trans. | ν00 |
---|---|---|---|---|---|---|---|---|---|---|---|---|
Unidentified line structure at 42570 cm-1 [em. and abs., Guntsch, 1934 Guntsch, 1935 Turner and Harris, 1937 Guntsch, 1939] and 43180 - 43520 cm-1 [abs., Khan, 1962]. | ||||||||||||
I (2Π) | [5.96] | [2E-4] | [1.710] | I ← X V | 47997.6 Z | |||||||
↳Khan, 1962 | ||||||||||||
H (2Σ+) 1 | H ← X R | 47543 (Z) | ||||||||||
↳Khan, 1962 | ||||||||||||
G (2Σ+) 2 | G ← X V | 46082 (Z) | ||||||||||
↳Khan, 1962 | ||||||||||||
State | Te | ωe | ωexe | ωeye | Be | αe | γe | De | βe | re | Trans. | ν00 |
D 2Σ- | (42065) | (1630) 3 | [6.296] 4 | [3.8E-4] | [1.664] | D → A V | 22861.5 5 | |||||
↳Guntsch, 1937; Guntsch, 1939 | ||||||||||||
C 2Π(r) | (41164) 6 | [1623.4] Z | 6.161 7 | 0.144 | 3.0E-4 | 1.682 | C → A | 21956.5 5 | ||||
↳Pearse, 1929; Guntsch, 1934; Guntsch, 1937, 2; Guntsch, 1939 | ||||||||||||
C ↔ X V | 41235.9 Z | |||||||||||
↳missing citation; Guntsch, 1935; Grundstrom, 1936; Guntsch, 1937, 2; Turner and Harris, 1937; Guntsch, 1939; missing citation | ||||||||||||
E 2Σ+ | (35568) | [1444.8] Z | 8 | 6.23 | 0.30 9 | [3.3E-4] 10 | 1.673 | E ← X VR | 35550.6 Z | |||
↳Khan, 1961; missing citation; Balfour and Cartwright, 1975 | ||||||||||||
State | Te | ωe | ωexe | ωeye | Be | αe | γe | De | βe | re | Trans. | ν00 |
B' 2Σ+ | 22410.5 | 828.0 Z | 11.6 11 | [2.596] | 12 | 1.2E-4 | 0.13E-4 | 2.597 | B' → X R | 22081.9 Z | ||
↳Balfour and Cartwright, 1975; Balfour and Cartwright, 1976 | ||||||||||||
A 2Πr | 19226.8 13 | 1598.17 Z | 31.085 14 | -0.633 | 6.1913 | 0.1931 15 | 0.0005 | 3.60E-4 16 | 1.6778 | A ↔ X 17 18 V | 19278.4 5 | |
↳Guntsch, 1937; Guntsch, 1939; Balfour, 1970; Balfour, 1970, 2; Balfour and Cartwright, 1976, 2 | ||||||||||||
X 2Σ+ | 0 | 1495.20 Z | 31.889 19 | 0.384 | 5.8257 | 0.1859 20 | 3.44E-4 16 | 1.7297 21 | ||||
↳Knight and Weltner, 1971 |

References

Chase, 1998
Chase, M.W., Jr.,
NIST-JANAF Themochemical Tables, Fourth Edition,
J. Phys. Chem. Ref. Data, Monograph 9, 1998, 1-1951. [all data]
Rackwitz, Feldman, et al., 1977
Rackwitz, R.; Feldman, D.; Kaiser, H.J.; Heincke, E.,
Photodetachment bei einigen zweiatomigen negativen hydridionen: BeH-, MgH-, CaH-, ZnH-, PH-, AsH-,
Z. Naturforsch. A:, 1977, 32, 594. [all data]
Hinde, 2000
Hinde, R.J.,
Ab initio gas-phase acidities of NaH, MgH2, and AlH3,
J. Phys. Chem. A, 2000, 104, 32, 7580-7585, https://doi.org/10.1021/jp994138j
. [all data]
Guntsch, 1934
Guntsch, A.,
Uber das bandenspektrum des magnesiumhydrids,
Z. Phys., 1934, 87, 312. [all data]
Guntsch, 1935
Guntsch, A.,
Uber das ultraviolette bandenspektrum des magnesiumhydrids und magnesiumdeutrids,
Z. Phys., 1935, 93, 534. [all data]
Turner and Harris, 1937
Turner, L.A.; Harris, W.T.,
The ultraviolet bands of magnesium hydride,
Phys. Rev., 1937, 52, 626. [all data]
Guntsch, 1939
Guntsch,
Dissertation, Stockholm, 1939, 1. [all data]
Khan, 1962
Khan, M.A.,
MgH bands at 2172, 2100 and 2088 Å and MgD bands at 2172, 2358 and 2364 A,
Proc. Phys. Soc. London, 1962, 80, 209. [all data]
Guntsch, 1937
Guntsch, A.,
Neue untersuchungen uber das bandenspektrum des magnesiumhydrids,
Z. Phys., 1937, 104, 584. [all data]
Pearse, 1929
Pearse, R.W.B.,
The ultra-violet spectrum of magnesium hydride. 1. The band at λ2430,
Proc. R. Soc. London A, 1929, 122, 442. [all data]
Guntsch, 1937, 2
Guntsch, A.,
Uber einige neue banden des magnesiumhydrids,
Z. Phys., 1937, 107, 420. [all data]
Grundstrom, 1936
Grundstrom,
Dissertation, Stockholm, 1936, 0. [all data]
Khan, 1961
Khan, M.A.,
MgH and MgD bands at 2819 Å and 2702 Å,
Proc. Phys. Soc. London, 1961, 77, 1133. [all data]
Balfour and Cartwright, 1975
Balfour, W.J.; Cartwright, H.M.,
Low-lying electronic states of magnesium hydride,
Chem. Phys. Lett., 1975, 32, 82. [all data]
Balfour and Cartwright, 1976
Balfour, W.J.; Cartwright, H.M.,
The B'2Σ+ → X2Σ+ systems of MgH and MgD,
Can. J. Phys., 1976, 54, 1898. [all data]
Balfour, 1970
Balfour, W.J.,
The A2Π → X2Σ+ systems of 24MgH, 25MgH, and 26MgH,
Astrophys. J., 1970, 162, 1031. [all data]
Balfour, 1970, 2
Balfour, W.J.,
The electronic spectrum of magnesium hydride and magnesium deuteride,
J. Phys. B:, 1970, 3, 1749. [all data]
Balfour and Cartwright, 1976, 2
Balfour, W.J.; Cartwright, H.M.,
The A2Π-X2Σ+ system and dissociation energy of magnesiun hydride,
Astron. Astrophys. Suppl. Ser., 1976, 26, 389. [all data]
Knight and Weltner, 1971
Knight, L.B., Jr.; Weltner, W., Jr.,
Hyperfine interaction and chemical bonding in MgH, CaH, SrH, and BaH molecules,
J. Chem. Phys., 1971, 54, 3875. [all data]
Grundstrom, 1936, 2
Grundstrom, B.,
Absorption spectrum of magnesium hydride in the ultra-violet,
Nature (London), 1936, 131, 108. [all data]
Guntsch, 1938
Guntsch, A.,
Druckeffekt in der magnesiumhydridbande bei λ2590 Å,
Z. Phys., 1938, 110, 549. [all data]
Sink, Bandrauk, et al., 1976
Sink, M.L.; Bandrauk, A.D.; Henneker, W.H.; Lefebvre-Brion, H.; Raseev, G.,
Theoretical study of the low-lying electronic states of MgH,
Chem. Phys. Lett., 1976, 39, 505. [all data]
Main, Carlson, et al., 1967
Main, R.P.; Carlson, D.J.; DuPuis, R.A.,
Measurement of oscillator strengths of the MgO(B1Σ+ - X1Σ+) and MgH(A2Π - X2Σ+) band systems,
J. Quant. Spectrosc. Radiat. Transfer, 1967, 7, 805. [all data]
Branch, 1970
Branch, D.,
Isotopes of magnesium in the sun,
Astrophys. J., 1970, 159, 39. [all data]
Boyer, 1971
Boyer, R.,
Isotopic lines of the MgH molecule,
Astron. Astrophys., 1971, 12, 464. [all data]
Meyer and Rosmus, 1975
Meyer, W.; Rosmus, P.,
PNO-Cl and CEPA studies of electron correlation effects. III. Spectroscopic constants and dipole moment functions for the ground states of the first-row and second-row diatomic hydrides,
J. Chem. Phys., 1975, 63, 2356. [all data]