Nitrosyl hydride
- Formula: HNO
- Molecular weight: 31.0140
- IUPAC Standard InChIKey: ODUCDPQEXGNKDN-UHFFFAOYSA-N
- CAS Registry Number: 14332-28-6
- Chemical structure:
View 3d structure (requires JavaScript / HTML 5) - Permanent link for this species. Use this link for bookmarking this species for future reference.

Gas phase thermochemistry data

Quantity | Value | Units | Method | Reference | Comment |
---|---|---|---|---|---|
ΔfH°gas | 99.58 | kJ/mol | Review | Chase, 1998 | Data last reviewed in March, 1993 |
Quantity | Value | Units | Method | Reference | Comment |
S°gas,1 bar | 220.72 | J/mol*K | Review | Chase, 1998 | Data last reviewed in March, 1993 |
Gas Phase Heat Capacity (Shomate Equation)
Cp° = A + B*t + C*t2 + D*t3 +
E/t2
H° − H°298.15= A*t + B*t2/2 +
C*t3/3 + D*t4/4 − E/t + F − H
S° = A*ln(t) + B*t + C*t2/2 + D*t3/3 −
E/(2*t2) + G
Cp = heat capacity (J/mol*K)
H° = standard enthalpy (kJ/mol)
S° = standard entropy (J/mol*K)
t = temperature (K) / 1000.
View plot Requires a JavaScript / HTML 5 canvas capable browser.
Temperature (K) | 298. to 1200. | 1200. to 6000. |
---|---|---|
A | 19.85936 | 52.25649 |
B | 48.00847 | 3.105872 |
C | -25.41065 | -0.598149 |
D | 5.234644 | 0.039904 |
E | 0.230115 | -7.452039 |
F | 92.51033 | 67.95904 |
G | 232.8199 | 263.2531 |
H | 99.57920 | 99.57920 |
Reference | Chase, 1998 | Chase, 1998 |
Comment | Data last reviewed in March, 1993 | Data last reviewed in March, 1993 |

Reaction thermochemistry data

Data compiled by: John E. Bartmess
Individual Reactions
Quantity | Value | Units | Method | Reference | Comment |
---|---|---|---|---|---|
ΔrH° | 1511.6 ± 0.63 | kJ/mol | D-EA | Travers, Cowles, et al., 1989 | gas phase; ground state triplet anion |
Quantity | Value | Units | Method | Reference | Comment |
ΔrG° | 1484.0 ± 1.4 | kJ/mol | H-TS | Travers, Cowles, et al., 1989 | gas phase; ground state triplet anion |
By formula: F- + HNO = (F- • HNO)
Quantity | Value | Units | Method | Reference | Comment |
---|---|---|---|---|---|
ΔrH° | 138. ± 13. | kJ/mol | IMRB | Janaway, Zhong, et al., 1997 | gas phase; Actual structure probably HF..NO- |

Gas phase ion energetics data

Data compiled as indicated in comments:
B - John E. Bartmess
LL - Sharon G. Lias and Joel F. Liebman
Electron affinity determinations
EA (eV) | Method | Reference | Comment |
---|---|---|---|
0.338 ± 0.015 | LPES | Ellis and Ellison, 1983 | B |
Ionization energy determinations
IE (eV) | Method | Reference | Comment |
---|---|---|---|
10.1 | DER | Lias, Bartmess, et al., 1988 | LL |
De-protonation reactions
Quantity | Value | Units | Method | Reference | Comment |
---|---|---|---|---|---|
ΔrH° | 361.27 ± 0.15 | kcal/mol | D-EA | Travers, Cowles, et al., 1989 | gas phase; ground state triplet anion; B |
Quantity | Value | Units | Method | Reference | Comment |
ΔrG° | 354.68 ± 0.34 | kcal/mol | H-TS | Travers, Cowles, et al., 1989 | gas phase; ground state triplet anion; B |

References

Chase, 1998
Chase, M.W., Jr.,
NIST-JANAF Themochemical Tables, Fourth Edition,
J. Phys. Chem. Ref. Data, Monograph 9, 1998, 1-1951. [all data]
Travers, Cowles, et al., 1989
Travers, M.J.; Cowles, D.C.; Ellison, G.B.,
Reinvestigation of the Electron Affinities of O2 and NO,
Chem. Phys. Lett., 1989, 164, 5, 449, https://doi.org/10.1016/0009-2614(89)85237-6
. [all data]
Janaway, Zhong, et al., 1997
Janaway, G.A.; Zhong, M.; Gatev, G.G.; Chabinyc, M.L.; Brauman, J.I.,
[FHNO]-: An Intermediate in a Spin-Forbidden Proton Transfer Reaction,
J. Am. Chem. Soc., 1997, 119, 48, 11697, https://doi.org/10.1021/ja9726872
. [all data]