Tetraglyme
- Formula: C10H22O5
- Molecular weight: 222.2787
- IUPAC Standard InChIKey: ZUHZGEOKBKGPSW-UHFFFAOYSA-N
- CAS Registry Number: 143-24-8
- Chemical structure:

Condensed phase thermochemistry data

Data compiled by: Eugene S. Domalski and Elizabeth D. Hearing
Constant pressure heat capacity of liquid
Cp,liquid (cal/mol*K) | Temperature (K) | Reference |
---|---|---|
109.25 | 298.15 | Trejo, Costas, et al., 1991 |

Phase change data

Data compiled as indicated in comments:
BS - Robert L. Brown and Stephen E. Stein
TRC - Thermodynamics Research Center, NIST Boulder Laboratories, Chris Muzny director
AC - William E. Acree, Jr., James S. Chickos
Quantity | Value | Units | Method | Reference | Comment |
---|---|---|---|---|---|
Tboil | 549.0 | K | N/A | Weast and Grasselli, 1989 | BS |
Tboil | 548.15 | K | N/A | Anonymous, 1982 | TRC |
Quantity | Value | Units | Method | Reference | Comment |
Tfus | 243.45 | K | N/A | Anonymous, 1982 | TRC |
Quantity | Value | Units | Method | Reference | Comment |
ΔvapH° | 18.4 ± 0.62 | kcal/mol | CGC | Nichols, Orf, et al., 2000 | AC |
Enthalpy of vaporization
ΔvapH (kcal/mol) | Temperature (K) | Method | Reference | Comment |
---|---|---|---|---|
14. | 434. | A | Stephenson and Malanowski, 1987 | Based on data from 419. to 553. K.; AC |

Gas phase ion energetics data

Data evaluated by: Edward P. Hunter and Sharon G. Lias
Quantity | Value | Units | Method | Reference | Comment |
---|---|---|---|---|---|
Proton affinity (review) | 228.0 | kcal/mol | N/A | Hunter and Lias, 1998 | |
Quantity | Value | Units | Method | Reference | Comment |
Gas basicity | 214.6 | kcal/mol | N/A | Hunter and Lias, 1998 |

References

Trejo, Costas, et al., 1991
Trejo, L.M.; Costas, M.; Patterson, D.,
Excess heat capacity of organic mixtures, Internat. DATA Series,
Selected Data Mixt., 1991, Ser. [all data]
Weast and Grasselli, 1989
CRC Handbook of Data on Organic Compounds, 2nd Editon, Weast,R.C and Grasselli, J.G., ed(s)., CRC Press, Inc., Boca Raton, FL, 1989, 1. [all data]
Anonymous, 1982
Anonymous, X.,
Glymes Grant Chemical, 1982, Baton Rouge, LA 1982. [all data]
Nichols, Orf, et al., 2000
Nichols, Gary; Orf, Jennifer; Reiter, Sarah M.; Chickos, James; Gokel, George W.,
The vaporization enthalpies of some crown and polyethers by correlation gas chromatography,
Thermochimica Acta, 2000, 346, 1-2, 15-28, https://doi.org/10.1016/S0040-6031(99)00405-0
. [all data]
Stephenson and Malanowski, 1987
Stephenson, Richard M.; Malanowski, Stanislaw,
Handbook of the Thermodynamics of Organic Compounds, 1987, https://doi.org/10.1007/978-94-009-3173-2
. [all data]