Ethanol, 2-[2-(2-butoxyethoxy)ethoxy]-
- Formula: C10H22O4
- Molecular weight: 206.2793
- IUPAC Standard InChIKey: COBPKKZHLDDMTB-UHFFFAOYSA-N
- CAS Registry Number: 143-22-6
- Chemical structure:
View 3d structure (requires JavaScript / HTML 5) - Other names: Butoxytriethylene glycol; Butoxytriglycol; Dowanol TBAT; Triethylene glycol monobutyl ether; Triglycol monobutyl ether; 2-[2-(2-Butoxyethoxy)ethoxy]ethanol; 3,6,9-Trioxatridecan-1-ol; Triethylene glycol butyl ether; Triethylene glycol mono-n-butyl ether; Triethylene glycol n-butyl ether; Poly-solv TB; 3,6,9-Trioxa-1-tridecanol; NSC 164915; triethylene glycol butyl ester

Kovats' RI, non-polar column, isothermal

Column type | Active phase | Temperature (C) | I | Reference | Comment |
---|---|---|---|---|---|
Packed | SE-30 | 170. | 1479. | Voelkel, 1987 | He, Chromaton N Super (75-100 mesh); Column length: 1. m |

Van Den Dool and Kratz RI, non-polar column, temperature ramp

Column type | Active phase | I | Reference | Comment |
---|---|---|---|---|
Capillary | Ultra-2 | 1464. | Poskrobko, Linkiewicz, et al., 1994 | 25. m/0.32 mm/0.52 μm, H2, 8. K/min; Tstart: 50. C; Tend: 310. C |

Van Den Dool and Kratz RI, non-polar column, custom temperature program

Column type | Active phase | I | Reference | Comment |
---|---|---|---|---|
Capillary | VF-5MS | 1475.6 | Zheng and White, 2008 | 30. m/0.25 mm/0.25 μm, He; Program: not specified |

References

Voelkel, 1987
Voelkel, A.,
Retention Indices and Thermodynamic Functions of Solution for Model Non-Ionic Surfactants in Standard Stationary Phases Determined by Gas Chromatography,
J. Chromatogr., 1987, 387, 95-104, https://doi.org/10.1016/S0021-9673(01)94516-9
. [all data]
Poskrobko, Linkiewicz, et al., 1994
Poskrobko, J.; Linkiewicz, M.; Jaworski, M.,
Analysis of high-boiling ethoxylates of methyl, ethyl and butyl alcohols, with the use of gas chromatography,
Chem. Anal. (Warsaw), 1994, 39, 2, 153-159. [all data]
Zheng and White, 2008
Zheng, Y.; White, E.,
Retention Data. NIST Mass Spectrometry Data Center., NIST Mass Spectrometry Data Center, 2008. [all data]