C10H11NO2
- Formula: C10H11NO2
- Molecular weight: 177.1998
- CAS Registry Number: 14320-56-0

Gas phase ion energetics data

Data compiled by: John E. Bartmess
De-protonation reactions
C10H10NO2- + = C10H11NO2
By formula: C10H10NO2- + H+ = C10H11NO2
Quantity | Value | Units | Method | Reference | Comment |
---|---|---|---|---|---|
ΔrH° | 1395. ± 9.2 | kJ/mol | G+TS | Koppel, Mishima, et al., 1993 | gas phase |
Quantity | Value | Units | Method | Reference | Comment |
ΔrG° | 1365. ± 8.4 | kJ/mol | IMRE | Koppel, Mishima, et al., 1993 | gas phase |
ΔrG° | 1365. ± 8.4 | kJ/mol | IMRE | Taft and Topsom, 1987 | gas phase; value altered from reference due to change in acidity scale |

References

Koppel, Mishima, et al., 1993
Koppel, I.A.; Mishima, M.; Stock, L.M.; Taft, R.W.; Topsom, R.D.,
Acidities of 4-Substituted Benzoic, Bicyclo[2.2.2]Oct-1-yl and Bicyclo[2.2.2]Oct-2-enyl Carboxylic Acids,
J. Phys. Org. Chem., 1993, 6, 12, 685, https://doi.org/10.1002/poc.610061205
. [all data]
Taft and Topsom, 1987
Taft, R.W.; Topsom, R.D.,
The Nature and Analysis of Substituent Effects,
Prog. Phys. Org. Chem., 1987, 16, 1. [all data]