1-Hexanamine, N-hexyl-
- Formula: C12H27N
- Molecular weight: 185.3495
- IUPAC Standard InChIKey: PXSXRABJBXYMFT-UHFFFAOYSA-N
- CAS Registry Number: 143-16-8
- Chemical structure:
View 3d structure (requires JavaScript / HTML 5) - Other names: Dihexylamine; Di-N-hexylamine; di-Normal-hexylamine; N-Hexylhexanamine; N,N-Dihexylamine; Bis(1-hexyl)amine

Phase change data

Data compiled as indicated in comments:
BS - Robert L. Brown and Stephen E. Stein
TRC - Thermodynamics Research Center, NIST Boulder Laboratories, Chris Muzny director
AC - William E. Acree, Jr., James S. Chickos
Quantity | Value | Units | Method | Reference | Comment |
---|---|---|---|---|---|
Tboil | 466.7 | K | N/A | Weast and Grasselli, 1989 | BS |
Tboil | 466.65 | K | N/A | Mailhe, 1918 | Uncertainty assigned by TRC = 10. K; TRC |
Quantity | Value | Units | Method | Reference | Comment |
Tfus | 273.65 | K | N/A | Sudaricov, Phrolov, et al., 1963 | Metastable crystal phase; Uncertainty assigned by TRC = 1. K; TRC |
Tfus | 286.21 | K | N/A | Sudaricov, Phrolov, et al., 1963 | Uncertainty assigned by TRC = 0.3 K; TRC |
Tfus | 258.5 | K | N/A | Anonymous, 1955 | Uncertainty assigned by TRC = 0.6 K; TRC |
Tfus | 260.09 | K | N/A | Hoerr, Harwood, et al., 1946 | Uncertainty assigned by TRC = 0.15 K; TRC |
Enthalpy of vaporization
ΔvapH (kJ/mol) | Temperature (K) | Method | Reference | Comment |
---|---|---|---|---|
55.1 | 423. | A | Stephenson and Malanowski, 1987 | Based on data from 408. to 569. K.; AC |

References

Weast and Grasselli, 1989
CRC Handbook of Data on Organic Compounds, 2nd Editon, Weast,R.C and Grasselli, J.G., ed(s)., CRC Press, Inc., Boca Raton, FL, 1989, 1. [all data]
Mailhe, 1918
Mailhe, A.,
Direct Transformation of secondary and tertiary amines to nitriles,
C. R. Hebd. Seances Acad. Sci., 1918, 166, 996. [all data]
Sudaricov, Phrolov, et al., 1963
Sudaricov, B.N.; Phrolov, U.G.; Ilichev, V.A.I.; Pushcov, A.A.; Zaharov-Narcissov, O.I.; Ochkin, A.B.,
Physicochemical Properties of Certain n-Aliphatic Amines,
Tr. Inst. - Mosk. Khim. -Tekhnol. Inst. im. D. I. Mendele- eva, 1963, 43, 21. [all data]
Anonymous, 1955
Anonymous, R.,
, Am. Pet. Inst. Res. Proj. 45, Tech. Rep. 14, No. 1, Ohio State Univ., 1955. [all data]
Hoerr, Harwood, et al., 1946
Hoerr, C.W.; Harwood, H.J.; Ralston, A.W.,
Dimorphism of Symmetrical Normal Aliphatic Secondary Amines of High Molecular Weight.,
J. Org. Chem., 1946, 11, 199. [all data]
Stephenson and Malanowski, 1987
Stephenson, Richard M.; Malanowski, Stanislaw,
Handbook of the Thermodynamics of Organic Compounds, 1987, https://doi.org/10.1007/978-94-009-3173-2
. [all data]