1,1,3-Trimethoxypropane
- Formula: C6H14O3
- Molecular weight: 134.1736
- IUPAC Standard InChIKey: FKZYYYDRLJCHGL-UHFFFAOYSA-N
- CAS Registry Number: 14315-97-0
- Chemical structure:
View 3d structure (requires JavaScript / HTML 5) - Permanent link for this species. Use this link for bookmarking this species for future reference.

Phase change data

Data compiled by: Robert L. Brown and Stephen E. Stein
Reduced pressure boiling point
Tboil (K) | Pressure (bar) | Reference |
---|---|---|
325. to 328. | 0.027 | Frinton Laboratories Inc., 1986 |

References

Frinton Laboratories Inc., 1986
Frinton Laboratories Inc.,
Catalog Number 11, Frinton Laboratories Inc., Vineland, NJ, 1986, 99. [all data]