Benzo[b]thiophene, 5-methyl-
- Formula: C9H8S
- Molecular weight: 148.225
- IUPAC Standard InChIKey: DOHZWDWNQFZIKH-UHFFFAOYSA-N
- CAS Registry Number: 14315-14-1
- Chemical structure:
View 3d structure (requires JavaScript / HTML 5) - Other names: 5-Methylbenzo[b]thiophene; 5-Methyl-1-benzothiophene; 5-Methyl-benzothiophene; Benzothiophene, 5-mehyl

Lee's RI, non-polar column, temperature ramp

Column type | Active phase | I | Reference | Comment |
---|---|---|---|---|
Capillary | DB-5 | 221.81 | Williams and Bottrill, 1995 | He, 60. C @ 2. min, 5. K/min; Column length: 25. m; Column diameter: 0.3 mm; Tend: 270. C |
Capillary | OV-73 | 222.0 | Arpino, Ignatiadis, et al., 1987 | 68. m/0.28 mm/0.15 μm, 1.5 K/min |
Capillary | SE-52 | 222.09 | Vassilaros, Kong, et al., 1982 | 20. m/0.30 mm/0.25 μm, H2, 40. C @ 2. min, 4. K/min; Tend: 265. C |

Lee's RI, non-polar column, custom temperature program

Column type | Active phase | I | Reference | Comment |
---|---|---|---|---|
Capillary | SPB-5 | 214.77 | Thuss, Popp, et al., 2000 | 60. m/0.32 mm/0.10 μm, He; Program: A: 105 0C (2 min) 2.5 0C -> 230 0C 50 0C/min -> 305 0C (15 min) B: 95 0C (2 min) 3.8 0C/min -> 310 0C (5 min) |

References

Williams and Bottrill, 1995
Williams, P.T.; Bottrill, R.P.,
Sulfur-polycyclic aromatic hydrocarbons in tyre pyrolysis oil,
Fuel, 1995, 74, 5, 736-742, https://doi.org/10.1016/0016-2361(94)00005-C
. [all data]
Arpino, Ignatiadis, et al., 1987
Arpino, P.J.; Ignatiadis, I.; de Rycke, G.,
Sulphur-containing polynuclear aromatic hydrocarbons from petroleum. Examination of their possible statistical formation in sediments,
J. Chromatogr., 1987, 390, 2, 329-348, https://doi.org/10.1016/S0021-9673(01)94385-7
. [all data]
Vassilaros, Kong, et al., 1982
Vassilaros, D.L.; Kong, R.C.; Later, D.W.; Lee, M.L.,
Linear retention index system for polycyclic aromatic compounds. Critical evaluation and additional indices,
J. Chromatogr., 1982, 252, 1-20, https://doi.org/10.1016/S0021-9673(01)88394-1
. [all data]
Thuss, Popp, et al., 2000
Thuss, U.; Popp, P.; Ehrlich, C.; Kalkoff, W.-D.,
Identification and quantification of thaarenes in the flue gas of lignite-fired domestic heating,
J. Hi. Res. Chromatogr., 2000, 23, 7/8, 457-473, https://doi.org/10.1002/1521-4168(20000801)23:7/8<457::AID-JHRC457>3.0.CO;2-7
. [all data]