1-Decanethiol
- Formula: C10H22S
- Molecular weight: 174.347
- IUPAC Standard InChIKey: VTXVGVNLYGSIAR-UHFFFAOYSA-N
- CAS Registry Number: 143-10-2
- Chemical structure:
View 3d structure (requires JavaScript / HTML 5) - Other names: Decyl mercaptan; 1-Mercaptodecane; n-Decyl mercaptan; Decanethiol-(1); 1-Decylthiol; decane-1-thiol

Gas phase thermochemistry data

Data compiled by: Hussein Y. Afeefy, Joel F. Liebman, and Stephen E. Stein
Quantity | Value | Units | Method | Reference | Comment |
---|---|---|---|---|---|
ΔfH°gas | -211.9 ± 1.5 | kJ/mol | Ccr | Good and DePrater, 1966 |

Condensed phase thermochemistry data

Data compiled as indicated in comments:
ALS - Hussein Y. Afeefy, Joel F. Liebman, and Stephen E. Stein
DH - Eugene S. Domalski and Elizabeth D. Hearing
Quantity | Value | Units | Method | Reference | Comment |
---|---|---|---|---|---|
ΔfH°liquid | -276.4 ± 1.4 | kJ/mol | Ccr | Good and DePrater, 1966 | ALS |
Quantity | Value | Units | Method | Reference | Comment |
ΔcH°liquid | -7405.1 ± 1.2 | kJ/mol | Ccr | Good and DePrater, 1966 | ALS |
Quantity | Value | Units | Method | Reference | Comment |
S°liquid | 476.13 | J/mol*K | N/A | Finke, McCullough, et al., 1970 | DH |
Constant pressure heat capacity of liquid
Cp,liquid (J/mol*K) | Temperature (K) | Reference | Comment |
---|---|---|---|
365.44 | 300. | Tutubalina, Gabdrakhmanov, et al., 1982 | T = 273 to 373 K. Cp = 346.70 + 3.600x10-2T + 8.824x10-5T2.; DH |
350.41 | 298.15 | Finke, McCullough, et al., 1970 | T = 10 to 370 K.; DH |
349.63 | 298.15 | Good and DePrater, 1966 | DH |

Kovats' RI, non-polar column, isothermal

View large format table.

Column type Active phase Temperature (C) I Reference Comment
PackedApiezon M130.1334.Garbuzov, Misharina, et al., 1985He or N2, Chromosorb W, AW-DMCS; Column length: 2.1 m
PackedOV-101130.1320.Zygmunt, Wardencki, et al., 1983Ar, Gas-Chrom Q; Column length: 1.5 m
PackedOV-101130.1324.Zygmunt, Wardencki, et al., 1983Ar, Gas-Chrom Q; Column length: 1.5 m

Kovats' RI, non-polar column, custom temperature program

View large format table.

Column type Active phase I Reference Comment
CapillaryApiezon M1334.Zhu, Wang, et al., 2007Program: not specified

Kovats' RI, polar column, custom temperature program

View large format table.

Column type Active phase I Reference Comment
CapillaryPEG-20M1571.Zhu, Wang, et al., 2007Program: not specified

Normal alkane RI, non-polar column, temperature ramp

View large format table.

Column type Active phase I Reference Comment
CapillaryDB-5MS1323.Zoghbi, Andrade, et al., 200230. m/0.25 mm/0.25 μm, He, 3. K/min; Tstart: 60. C; Tend: 270. C

References

Good and DePrater, 1966
Good, W.D.; DePrater, B.L.,
The enthalpies of combustion and formation of the 1-alkanethiols. The methylene increment to the enthalpy of formation,
J. Phys. Chem., 1966, 70, 3606-3609. [all data]
Finke, McCullough, et al., 1970
Finke, H.L.; McCullough, J.P.; Messerly, J.F.; Gutherie, G.B.; Douslin, D.R.,
Chemical thermodynamic properties for 1-alkanethiols,
J. Chem. Thermodyn., 1970, 2, 27-41. [all data]
Tutubalina, Gabdrakhmanov, et al., 1982
Tutubalina, V.P.; Gabdrakhmanov, F.G.; Konyukhova, T.M.,
Study of the heat capacity of n-sulfides, 1982, Teplo-Massoobmen Khim. [all data]