9H-Fluorene, 2-methyl-
- Formula: C14H12
- Molecular weight: 180.2451
- IUPAC Standard InChIKey: RKJHJMAZNPASHY-UHFFFAOYSA-N
- CAS Registry Number: 1430-97-3
- Chemical structure:
View 3d structure (requires JavaScript / HTML 5) - Other names: Fluorene, 2-methyl-; 2-Methylfluorene; 2-Methyl-9H-fluorene

Phase change data

Data compiled by: Robert L. Brown and Stephen E. Stein
Quantity | Value | Units | Method | Reference | Comment |
---|---|---|---|---|---|
Tboil | 591.2 | K | N/A | Weast and Grasselli, 1989 |

Reaction thermochemistry data

Data compiled by: John E. Bartmess
Individual Reactions
C14H11- + =
By formula: C14H11- + H+ = C14H12
Quantity | Value | Units | Method | Reference | Comment |
---|---|---|---|---|---|
ΔrH° | 1475. ± 9.2 | kJ/mol | G+TS | Taft, 1987 | gas phase; value altered from reference due to change in acidity scale |
Quantity | Value | Units | Method | Reference | Comment |
ΔrG° | 1443. ± 8.4 | kJ/mol | IMRE | Taft, 1987 | gas phase; value altered from reference due to change in acidity scale |

Gas phase ion energetics data

Data compiled by: John E. Bartmess
De-protonation reactions
C14H11- + =
By formula: C14H11- + H+ = C14H12
Quantity | Value | Units | Method | Reference | Comment |
---|---|---|---|---|---|
ΔrH° | 1475. ± 9.2 | kJ/mol | G+TS | Taft, 1987 | gas phase; value altered from reference due to change in acidity scale |
Quantity | Value | Units | Method | Reference | Comment |
ΔrG° | 1443. ± 8.4 | kJ/mol | IMRE | Taft, 1987 | gas phase; value altered from reference due to change in acidity scale |

Van Den Dool and Kratz RI, non-polar column, custom temperature program

Data compiled by: NIST Mass Spectrometry Data Center, William E. Wallace, director

Column type Capillary
Active phase DB-5
Column length (m) 30.
Carrier gas He
Substrate
Column diameter (mm) 0.25
Phase thickness (μm) 0.25
Program 60 0C 7 0C/min -> 130 0C 5 0C/min -> 200 0C 6 0C/min -> 260 0C 20 0C/min -> 320 0C (4 min)
I 1720.
ReferenceHavenga and Rohwer, 1999
Comment MSDC-RI

Kovats' RI, non-polar column, isothermal

Data compiled by: NIST Mass Spectrometry Data Center, William E. Wallace, director

Column type Capillary
Active phase OV-1
Column length (m) 25.
Carrier gas N2
Substrate
Column diameter (mm) 0.2
Phase thickness (μm) 0.33
Temperature (C) 160.
I 1676.
ReferenceZhang, Chen, et al., 1997
Comment MSDC-RI

Lee's RI, non-polar column, temperature ramp

Data compiled by: NIST Mass Spectrometry Data Center, William E. Wallace, director

Column type CapillaryCapillaryCapillaryCapillaryCapillary
Active phase DB-5MSHP-55 % Phenyl methyl siloxane5 % Phenyl methyl siloxanePTE-5
Column length (m) 30.30.  30.
Carrier gas  He
Substrate
Column diameter (mm) 0.250.3  0.25
Phase thickness (μm) 0.250.25  0.25
Tstart (C) 50.50.50.80.60.
Tend (C) 300.200.250.300.300.
Heat rate (K/min) 6.5.2.8.8.
Initial hold (min) 2.5. 2.1.5
Final hold (min) 16.15. 10.12.5
I 287.75288.7288.21287.70288.09
ReferenceSun, Zhou, et al., 2008Shao, Wang, et al., 2006Skrbic and Onjia, 2006Skrbic and Onjia, 2006Wang, Jia, et al., 2000
Comment MSDC-RI MSDC-RI MSDC-RI MSDC-RI MSDC-RI
Column type CapillaryCapillaryCapillaryCapillaryCapillary
Active phase HP-5SE-52DB-5DB-5CP Sil 8 CB
Column length (m) 30.30.25.30.50.
Carrier gas   HeHeHe
Substrate
Column diameter (mm) 0.250.300.30.320.25
Phase thickness (μm) 0.25  0.250.25
Tstart (C) 50.40.60.50.80.
Tend (C) 280.250.270.300.300.
Heat rate (K/min) 4.4.5.6.4.
Initial hold (min) 2. 2.2.
Final hold (min) 20.
I 288.78288.22286.72288.87288.5
ReferencePiao, Chu, et al., 1999Wang, Peng, et al., 1997Williams and Horne, 1995Wang, Fingas, et al., 1994Bundt, Herbel, et al., 1991
Comment MSDC-RI MSDC-RI MSDC-RI MSDC-RI MSDC-RI
Column type CapillaryCapillaryCapillary
Active phase DB-5SE-52SE-52
Column length (m) 30.20.12.
Carrier gas  H2He
Substrate
Column diameter (mm) 0.250.300.3
Phase thickness (μm) 0.250.250.34
Tstart (C) 40.40.50.
Tend (C) 280.265.250.
Heat rate (K/min) 4.4.2.
Initial hold (min) 2.2.
Final hold (min) 5.
I 288.29288.42288.21
ReferenceWise, Benner, et al., 1988Vassilaros, Kong, et al., 1982Lee, Vassilaros, et al., 1979
Comment MSDC-RI MSDC-RI MSDC-RI

Normal alkane RI, non-polar column, isothermal

Data compiled by: NIST Mass Spectrometry Data Center, William E. Wallace, director

Column type Packed
Active phase Polydimethyl siloxane
Column length (m)
Carrier gas
Substrate
Column diameter (mm)
Phase thickness (μm)
Temperature (C) 183.
I 1684.
ReferenceFerrand, 1962
Comment MSDC-RI

References

Weast and Grasselli, 1989
CRC Handbook of Data on Organic Compounds, 2nd Editon, Weast,R.C and Grasselli, J.G., ed(s)., CRC Press, Inc., Boca Raton, FL, 1989, 1. [all data]
Taft, 1987
Taft, R.W.,
The Nature and Analysis of Substitutent Electronic Effects,
Personal communication. See also Prog. Phys. Org. Chem., 1987, 16, 1. [all data]