1,2-Dimethyl cyclopropene
- Formula: C5H8
- Molecular weight: 68.1170
- IUPAC Standard InChIKey: QWKHRBFLFYXNDY-UHFFFAOYSA-N
- CAS Registry Number: 14309-32-1
- Chemical structure:
View 3d structure (requires JavaScript / HTML 5) - Other names: Cyclopropene, 1,2-dimethyl-

Phase change data

Data compiled by: Thermodynamics Research Center, NIST Boulder Laboratories, Chris Muzny director
Quantity | Value | Units | Method | Reference | Comment |
---|---|---|---|---|---|
Tboil | 312.0 | K | N/A | Turner, Goebel, et al., 1968 | Uncertainty assigned by TRC = 1. K |

Reaction thermochemistry data

Data compiled by: Hussein Y. Afeefy, Joel F. Liebman, and Stephen E. Stein
Individual Reactions
Quantity | Value | Units | Method | Reference | Comment |
---|---|---|---|---|---|
ΔrH° | -181. ± 4.2 | kJ/mol | Chyd | Turner, Goebel, et al., 1968, 2 | liquid phase; solvent: Acetic acid |

Kovats' RI, non-polar column, isothermal

Column type | Active phase | Temperature (C) | I | Reference | Comment |
---|---|---|---|---|---|
Capillary | OV-1 | 30. | 539. | Heberger, 1990 | 25. m/0.25 mm/0.50 μm, He |

References

Turner, Goebel, et al., 1968
Turner, R.B.; Goebel, P.; Mallon, B.J.; Doering, W. vonE.; Coburn, J.F.; Pomerantz, M.,
Heats of Hydrogenation VIII. Compounds with Three- and Four-Membered Rings,
J. Am. Chem. Soc., 1968, 90, 4315-22. [all data]
Turner, Goebel, et al., 1968, 2
Turner, R.B.; Goebel, P.; Mallon, B.J.; Doering, W.E.; Coburn, J.F., Jr.; Pomerantz, M.,
Heats of hydrogenation. VIII. Compounds with three- and four-membered rings,
J. Am. Chem. Soc., 1968, 90, 4315-4322. [all data]
Heberger, 1990
Heberger, K.,
Identification of C5H8 Isomers Through Reactions of Singlet Methylene, CH2(ã1A1), with Unsaturated Hydrocarbons Using Capillary Gas Chromatography - Mass Spectrometry,
Analyst, 1990, 115, 6, 725-729, https://doi.org/10.1039/an9901500725
. [all data]