Acetic acid, hexyl ester
- Formula: C8H16O2
- Molecular weight: 144.2114
- IUPAC Standard InChIKey: AOGQPLXWSUTHQB-UHFFFAOYSA-N
- CAS Registry Number: 142-92-7
- Chemical structure:
View 3d structure (requires JavaScript / HTML 5) - Isotopologues:
- Other names: n-Hexyl acetate; Hexyl acetate; Hexyl ethanoate; 1-Hexyl acetate; Acetic acid n-hexyl ester; n-Hexyl ethanoate; Hexyl alcohol, acetate; Hexylester kyseliny octove; Hexyl ester of acetic acid; NSC 7323; FEMA No. 2565

Phase change data

Data compiled as indicated in comments:
BS - Robert L. Brown and Stephen E. Stein
TRC - Thermodynamics Research Center, NIST Boulder Laboratories, Chris Muzny director
AC - William E. Acree, Jr., James S. Chickos
DH - Eugene S. Domalski and Elizabeth D. Hearing
Quantity | Value | Units | Method | Reference | Comment |
---|---|---|---|---|---|
Tboil | 443. ± 20. | K | AVG | N/A | Average of 9 values; Individual data points |
Quantity | Value | Units | Method | Reference | Comment |
Tfus | 212.10 | K | N/A | Vasil'ev and Petrov, 1984 | Uncertainty assigned by TRC = 0.05 K; TRC |
Tfus | 192.3 | K | N/A | Bilterys and Gisseleire, 1935 | Uncertainty assigned by TRC = 0.5 K; TRC |
Quantity | Value | Units | Method | Reference | Comment |
ΔvapH° | 12.4 ± 0.07 | kcal/mol | GS | Krasnykh, Verevkin, et al., 2006 | Based on data from 274. to 309. K.; AC |
ΔvapH° | 12.5 | kcal/mol | GC | Koutek, Hoskovec, et al., 1997 | AC |
Enthalpy of vaporization
ΔvapH (kcal/mol) | Temperature (K) | Method | Reference | Comment |
---|---|---|---|---|
12.2 | 318. | N/A | Arce, Blanco, et al., 1995 | Based on data from 303. to 444. K.; AC |
11.7 | 319. | A | Stephenson and Malanowski, 1987 | Based on data from 304. to 381. K.; AC |
11.0 | 387. | DTA | Meyer, Awe, et al., 1980 | Based on data from 378. to 459. K.; AC |
Enthalpy of fusion
ΔfusH (kcal/mol) | Temperature (K) | Reference | Comment |
---|---|---|---|
4.739 | 212.1 | Domalski and Hearing, 1996 | AC |

Reaction thermochemistry data

Data compiled by: Michael M. Meot-Ner (Mautner) and Sharon G. Lias
Individual Reactions
By formula: C3H9Si+ + C8H16O2 = (C3H9Si+ • C8H16O2)
Quantity | Value | Units | Method | Reference | Comment |
---|---|---|---|---|---|
ΔrH° | 50.4 | kcal/mol | PHPMS | Wojtyniak and Stone, 1986 | gas phase; switching reaction,Thermochemical ladder((CH3)3Si+)H2O, Entropy change calculated or estimated |
Quantity | Value | Units | Method | Reference | Comment |
ΔrS° | 32.0 | cal/mol*K | N/A | Wojtyniak and Stone, 1986 | gas phase; switching reaction,Thermochemical ladder((CH3)3Si+)H2O, Entropy change calculated or estimated |
Free energy of reaction
ΔrG° (kcal/mol) | T (K) | Method | Reference | Comment |
---|---|---|---|---|
35.5 | 468. | PHPMS | Wojtyniak and Stone, 1986 | gas phase; switching reaction,Thermochemical ladder((CH3)3Si+)H2O, Entropy change calculated or estimated |

Henry's Law data

Data compiled by: Rolf Sander
Henry's Law constant (water solution)
kH(T) = k°H exp(d(ln(kH))/d(1/T) ((1/T) - 1/(298.15 K)))
k°H = Henry's law constant for solubility in water at 298.15 K (mol/(kg*bar))
d(ln(kH))/d(1/T) = Temperature dependence constant (K)
k°H (mol/(kg*bar)) | d(ln(kH))/d(1/T) (K) | Method | Reference |
---|---|---|---|
1.9 | V | N/A |

Ion clustering data

Data compiled by: Michael M. Meot-Ner (Mautner) and Sharon G. Lias
Clustering reactions
By formula: C3H9Si+ + C8H16O2 = (C3H9Si+ • C8H16O2)
Quantity | Value | Units | Method | Reference | Comment |
---|---|---|---|---|---|
ΔrH° | 50.4 | kcal/mol | PHPMS | Wojtyniak and Stone, 1986 | gas phase; switching reaction,Thermochemical ladder((CH3)3Si+)H2O, Entropy change calculated or estimated |
Quantity | Value | Units | Method | Reference | Comment |
ΔrS° | 32.0 | cal/mol*K | N/A | Wojtyniak and Stone, 1986 | gas phase; switching reaction,Thermochemical ladder((CH3)3Si+)H2O, Entropy change calculated or estimated |
Free energy of reaction
ΔrG° (kcal/mol) | T (K) | Method | Reference | Comment |
---|---|---|---|---|
35.5 | 468. | PHPMS | Wojtyniak and Stone, 1986 | gas phase; switching reaction,Thermochemical ladder((CH3)3Si+)H2O, Entropy change calculated or estimated |

Normal alkane RI, non-polar column, custom temperature program

Data compiled by: NIST Mass Spectrometry Data Center, William E. Wallace, director

Column type CapillaryCapillaryCapillaryCapillaryCapillary
Active phase Polydimethyl siloxane with 5 % Ph groupsPolydimethyl siloxane with 5 % Ph groupsSiloxane, 5 % PhHP-1CP-Sil 8 CB
Column length (m)     30.
Carrier gas     Hydrogen
Substrate
Column diameter (mm)     0.25
Phase thickness (μm)     0.25
Program not specifiednot specifiednot specifiednot specified30 0C 3 0C/min -> 150 0C 20 0C/min -> 220 0C
I 1007.1016.997.996.1015.
ReferenceRobinson, Adams, et al., 2012Robinson, Adams, et al., 2012VOC BinBase, 2012Yasuda and Higuchi, 2012de Freitas, Garruti, et al., 2011
Comment MSDC-RI MSDC-RI MSDC-RI MSDC-RI MSDC-RI
Column type CapillaryCapillaryCapillaryCapillaryCapillary
Active phase DB-5Polydimethyl siloxane, 5 % phenylHP-5 MSBPX-5BPX-5
Column length (m) 60. 30.30.30.
Carrier gas Helium HeliumHeliumHelium
Substrate
Column diameter (mm) 0.25 0.320.250.25
Phase thickness (μm) 1.00 0.250.250.25
Program 40 0C 4 0C/min -> 230 0C 100 0C/min -> 260 0C (11.7 min)not specifiednot specified70 0C (1 min) 3 0C/min -> 142 0C 5 0C/min -> 225 0C (10 min)35 0C (5 min) 3 0C/min -> 210 0C 40 0C/min -> 240 0C (10 min)
I 1018.997.1009.1015.1022.
ReferenceMiyazaki, Plotto, et al., 2011Skogerson, Wohlgemuth, et al., 2011Pino, Marquez, et al., 2010Ortiz, Echeverra, et al., 2009se Souza, Cardeal, et al., 2009
Comment MSDC-RI MSDC-RI MSDC-RI MSDC-RI MSDC-RI
Column type CapillaryCapillaryCapillaryCapillaryCapillary
Active phase BPX-5DB-5 MSSqualaneCB-1CB-1
Column length (m) 30.30. 30.30.
Carrier gas HeliumHelium HeliumHelium
Substrate
Column diameter (mm) 0.250.25 0.250.25
Phase thickness (μm) 0.250.25 0.250.25
Program not specifiednot specifiednot specified40 0C (2 min) 4 0C/min -> 180 0C 20 0C/min -> 220 0C (1 min)not specified
I 1013.1007.988.1003.1006.
Referencese Souza, Cardeal, et al., 2009Su, Wang, et al., 2009Chen, 2008Kannaste, Vongvanich, et al., 2008Kannaste, Vongvanich, et al., 2008
Comment MSDC-RI MSDC-RI MSDC-RI MSDC-RI MSDC-RI
Column type CapillaryCapillaryCapillaryCapillaryCapillary
Active phase CP-Sil 8CB-MSHP-5HP-5HP-1DB-5
Column length (m) 30.30.30.50.30.
Carrier gas Helium  He
Substrate
Column diameter (mm) 0.250.250.250.20.25
Phase thickness (μm) 0.250.250.250.330.25
Program 50 0C(3 min) 3 0C/min -> 100 0C 2.7 0C/min -> 140 0C 2.4 0C/min -> 180 0C 6 0C/min -> 260 0C40 0C (2 min) 5 0C/min -> 80 0C 7 oC/min -> 160 0C 9 0C/min -> 200 0C 20 0C/min -> 280 0C (10 min)not specified40C(2min) => 2C/min => 200C => 15C/min => 250C (30min)50C(1min) => 5C/min => 100C => 10C/min => 250C (9min)
I 1009.1013.1015.990.1011.
ReferenceProfitt, Schatz, et al., 2008Zhao, Li, et al., 2008Zhao, Li, et al., 2008Barra, Baldovini, et al., 2007Beaulieu and Lancaster, 2007
Comment MSDC-RI MSDC-RI MSDC-RI MSDC-RI MSDC-RI
Column type CapillaryCapillaryCapillaryCapillaryCapillary
Active phase SPB-1DB-5LM-5LM-5LM-5
Column length (m) 30.30.30.30.30.
Carrier gas HeHeHeliumHeliumHelium
Substrate
Column diameter (mm) 0.250.250.250.250.25
Phase thickness (μm) 0.250.25
Program 40C(10min) => 2C/min => 200C(1min) => 2C/min => 250C (10min)40C(1min) => 7C/min => 110C => 5C/min => 180C => 10C/min => 240C(10min)50 0C (10 min) 2 oC/min -> 75 0C 3 0C/min -> 150 0C 5 0C/min -> 200 0Cnot specifiednot specified
I 1012.1010.1024.1010.1012.
ReferenceBosch-Fuste, Riu-Aumatell, et al., 2007Greger and Schieberle, 2007Janzanntti, Franco, et al., 2007Janzanntti, Franco, et al., 2007Janzanntti, Franco, et al., 2007
Comment MSDC-RI MSDC-RI MSDC-RI MSDC-RI MSDC-RI
Column type CapillaryCapillaryCapillaryCapillaryCapillary
Active phase VB-5SE-30CP-SilCP-SilUltra-2
Column length (m) 60. 30.30.25.
Carrier gas He HeliumHeliumH2
Substrate
Column diameter (mm) 0.25 0.250.250.25
Phase thickness (μm) 1. 0.250.250.33
Program 35C(1min) => 4C/min => 175C => 10C/min => 260Cnot specified50 0C (3 min) 3 0C/min -> 100 0C 2.7 0C/min -> 140 0C 2.4 0C/min -> 180 0C 6 0C/min -> 250 0C50 0C (3 min) 3 0C/min -> 100 0C 2.7 0C/min -> 140 0C 2.4 0C/min -> 180 0C 6 0C/min -> 250 0Cnot specified
I 997.988.1009.1012.1008.
ReferenceKarlshøj, Nielsen, et al., 2007Liu, Liang, et al., 2007Proffit, 2007Proffit, 2007Ceva-Antunes, Bizzo, et al., 2006
Comment MSDC-RI MSDC-RI MSDC-RI MSDC-RI MSDC-RI
Column type CapillaryCapillaryCapillaryCapillaryCapillary
Active phase SPB-1DB-5CP-Sil5 CB MSPolydimethyl siloxane with 5 % Ph groupsHP-5
Column length (m) 30.60.50.
Carrier gas
Substrate
Column diameter (mm) 0.250.250.32
Phase thickness (μm) 0.250.251.2
Program not specified50C => 5C/min => 100C => 15C/min => 250C (19C)36C(2min) => 20C/min => 85C => 1C/min => 145C => 3C/min => 250C(30min)not specifiednot specified
I 1012.1011.992.1008.1008.
ReferenceRiu-Aumatell, Bosch-Fuste´, et al., 2006Beaulieu, 2005Iraqi, Vermeulen, et al., 2005Pino, Marbot, et al., 2005Riu-Aumatell, Lopez-Tamames, et al., 2005
Comment MSDC-RI MSDC-RI MSDC-RI MSDC-RI MSDC-RI
Column type CapillaryCapillaryCapillaryCapillaryCapillary
Active phase SPB-5DB-5MSSE-30HP-5HP-5
Column length (m) 30.30. 30.30.
Carrier gas HeHe He
Substrate
Column diameter (mm) 0.250.25 0.250.25
Phase thickness (μm) 0.250.25 0.250.25
Program 30C(3min) => 5C/min => 80C => 4C/min => 95C => 5C/min => 115C => 10C/min => 200C40C => 2C/min => 60C => 4C/min => 260Cnot specified40C(1min) => 5C/min => 180C => 10C/min => 220C(2min)40C(6min) => 2.5C/min => 150C => 90C/min => 250C
I 1008.1008.995.1015.1014.
ReferenceCrook, Boylston, et al., 2004Maia, Andrade, et al., 2004Vinogradov, 2004Demyttenaere, Dagher, et al., 2003Jordán, Margaría, et al., 2003
Comment MSDC-RI MSDC-RI MSDC-RI MSDC-RI MSDC-RI
Column type CapillaryCapillaryCapillaryCapillaryCapillary
Active phase HP-5OV-101HP-5MSHP-5HP-5
Column length (m) 30. 30.30.30.
Carrier gas   He
Substrate
Column diameter (mm) 0.25 0.250.250.25
Phase thickness (μm) 0.25 0.250.250.25
Program 40C(6min) => 2.5C/min => 150C => 90C/min => 250Cnot specified40C(1min) => 5C/min => 220C => 10C/min => 240C(2min)not specifiednot specified
I 1008.1012.1015.1008.1010.
ReferenceJordán, Margaría, et al., 2003Krings, Banavara, et al., 2003Demyttenaere, Dagher, et al., 2002Jordán, Goodner, et al., 2002Jordán, Goodner, et al., 2002
Comment MSDC-RI MSDC-RI MSDC-RI MSDC-RI MSDC-RI
Column type CapillaryCapillaryCapillaryCapillaryCapillary
Active phase OV-101Methyl SiliconeSPB-1DB-5DB-5
Column length (m) 50. 60.30.30.
Carrier gas N2 He
Substrate
Column diameter (mm) 0.25 0.530.320.32
Phase thickness (μm)   5.1.1.
Program not specifiednot specified40C(6min) => 5C/min => 80C => 10C/min => 200C0C(5min) => 60C/min => 60C (5min) => 4C/min => 250C (5min)0C(5min) => 60C/min => 60C (5min) => 4C/min => 250C (5min)
I 993.996.992.1003.995.
ReferenceYang, 2001Estrada and Gutierrez, 1999Flanagan, Streete, et al., 1997Storer, Elmore, et al., 1993Storer, Elmore, et al., 1993
Comment MSDC-RI MSDC-RI MSDC-RI MSDC-RI MSDC-RI
Column type CapillaryCapillaryCapillaryCapillaryCapillary
Active phase DB-5SPB-1DB-1DB-1OV-101
Column length (m) 30.60.30.30.25.
Carrier gas  HeliumH2H2He
Substrate
Column diameter (mm) 0.320.530.250.250.31
Phase thickness (μm) 1.5.00.250.25
Program 0C(5min) => 60C/min => 60C (5min) => 4C/min => 250C (5min)40 0C (6 min) 5 0C/min -> 80 0C 10 0C/min -> 200 0C30C (2min) => 2C/min => 150C => 4C/min => 250C30C (2min) => 2C/min => 150C => 4C/min => 250Cnot specified
I 997.992.995.995.1012.
ReferenceStorer, Elmore, et al., 1993Strete, Ruprah, et al., 1992Takeoka, Flath, et al., 1988Takeoka, Flath, et al., 1988Morales and Duque, 1987
Comment MSDC-RI MSDC-RI MSDC-RI MSDC-RI MSDC-RI
Column type CapillaryCapillaryCapillaryCapillary
Active phase OV-101OV-101SF96+IgepalOV-1, SE-30, Methyl silicone, SP-2100, OV-101, DB-1, etc.
Column length (m) 50.50.152.50.
Carrier gas HeHe Hydrogen
Substrate
Column diameter (mm) 0.240.240.760.32
Phase thickness (μm)
Program not specifiednot specified25C(1min) => 5C/min => 50C (4min) => 1.25C/min => 180Cnot specified
I 1012.994.1000.990.
ReferenceZenkevich and Malamakhov, 1987Zenkevich and Malamakhov, 1987Flath, Altieri, et al., 1984Waggott and Davies, 1984
Comment MSDC-RI MSDC-RI MSDC-RI MSDC-RI

Normal alkane RI, polar column, temperature ramp

Data compiled by: NIST Mass Spectrometry Data Center, William E. Wallace, director

Column type CapillaryCapillaryCapillaryCapillaryCapillary
Active phase CP-Wax CBInnowaxDB-FFAPDB-WaxCP-Wax 57 CB
Column length (m) 30.30.30.30.50.
Carrier gas HeliumHeliumHeliumHeliumHydrogen
Substrate
Column diameter (mm) 0.250.250.320.250.25
Phase thickness (μm) 0.250.250.250.250.20
Tstart (C) 50.40.50.40.35.
Tend (C) 150.250.250.230.150.
Heat rate (K/min) 2.8.4.3.4.
Initial hold (min)  1.4.2.5.
Final hold (min) 5.2.755.5.17.5
I 1272.1277.1270.1270.1257.
ReferenceAlves, da Penha, et al., 2012Siristova, Prinosilova, et al., 2012Osorio, Carriazo, et al., 2011Zhao, Xu, et al., 2009Callejon, Morales, et al., 2008
Comment MSDC-RI MSDC-RI MSDC-RI MSDC-RI MSDC-RI
Column type CapillaryCapillaryCapillaryCapillaryCapillary
Active phase DB-WaxCarbowax 20MTR-WAXDB-WaxDB-Wax
Column length (m) 30.25.60.30.30.
Carrier gas HeHeliumH2HeHe
Substrate
Column diameter (mm) 0.250.250.250.250.32
Phase thickness (μm) 0.250.400.250.250.25
Tstart (C) 30.60.40.40.40.
Tend (C) 210.260.200.230.230.
Heat rate (K/min) 5.5.3.4.4.
Initial hold (min)   10.2.2.
Final hold (min)  40.10.5.15.
I 1275.1282.1274.1254.1254.
ReferenceKumazawa, Itobe, et al., 2008Kafkas and Paydas, 2007Tena N., Lazzez A., et al., 2007Xu, Fan, et al., 2007Fan and Qian, 2006
Comment MSDC-RI MSDC-RI MSDC-RI MSDC-RI MSDC-RI
Column type CapillaryCapillaryCapillaryCapillaryCapillary
Active phase DB-WaxTR-WAXDB-WaxInnowaxDB-Wax
Column length (m) 30.60.30.60.60.
Carrier gas N2HeN2HeNitrogen
Substrate
Column diameter (mm) 0.320.250.320.250.32
Phase thickness (μm) 0.250.250.250.250.50
Tstart (C) 40.40.40.60.35.
Tend (C) 230.200.230.240.235.
Heat rate (K/min) 6.3.4.5.2.
Initial hold (min) 2.10.2. 4.
Final hold (min) 15. 5.30.30.
I 1270.1274.1263.1276.1291.
ReferenceFan and Qian, 2006, 2Salas J.J., Garcia-Gonzalez D.L., et al., 2006Fan and Qian, 2005Joichi, Yomogida, et al., 2005Qian and Wang, 2005
Comment MSDC-RI MSDC-RI MSDC-RI MSDC-RI MSDC-RI
Column type CapillaryCapillaryCapillaryCapillaryCapillary
Active phase DB-WaxTR-WAXZB-WaxPEG-20MDB-Wax
Column length (m) 60.60.30.50.60.
Carrier gas  H2Helium H2
Substrate
Column diameter (mm) 0.530.250.320.200.32
Phase thickness (μm) 1.0.250.250.200.25
Tstart (C) 50.40.40.40.40.
Tend (C) 180.200.250.180.230.
Heat rate (K/min) 3.3.5.3.4.
Initial hold (min) 10.10.2.5.5.
Final hold (min)   5.30.25.
I 1307.1274.1259.1278.1271.
ReferenceRizzolo, Cambiaghi, et al., 2005Salas, Sánchez, et al., 2005N/ANarain, Almeida, et al., 2004Dregus and Engel, 2003
Comment MSDC-RI MSDC-RI MSDC-RI MSDC-RI MSDC-RI
Column type CapillaryCapillaryCapillaryCapillaryCapillary
Active phase Supelcowax-10Supelcowax-10DB-WaxFFAPDB-Wax
Column length (m) 30.30.60.30.30.
Carrier gas HeHeHeH2He
Substrate
Column diameter (mm) 0.250.250.250.320.25
Phase thickness (μm) 0.250.250.250.250.25
Tstart (C) 40.40.40.40.50.
Tend (C) 200.200.220.240.220.
Heat rate (K/min) 3.3.3.3.4.
Initial hold (min) 10.10.10.5.3.
Final hold (min)   10.
I 1274.1269.1271.1272.1235.
ReferenceVichi, Castellote, et al., 2003Vichi, Pizzale, et al., 2003Hayata, Sakamoto, et al., 2002Ducruet, Fournier, et al., 2001Weckerle, Bastl-Borrmann, et al., 2001
Comment MSDC-RI MSDC-RI MSDC-RI MSDC-RI MSDC-RI
Column type CapillaryCapillaryCapillaryCapillaryCapillary
Active phase DB-WaxDB-WaxSupelcowax-10Supelcowax-10Supelcowax-10
Column length (m) 30.30.30.60.60.
Carrier gas HeHeHeHeHe
Substrate
Column diameter (mm) 0.20.20.320.250.25
Phase thickness (μm)   0.250.250.25
Tstart (C) 50.50.70.60.60.
Tend (C) 180.180.240.280.280.
Heat rate (K/min) 3.3.5.4.4.
Initial hold (min) 8.8.8.
Final hold (min)   20.
I 1289.1290.1268.1262.1267.
ReferenceFranco and Shibamoto, 2000Franco and Shibamoto, 2000Kim, Kim, et al., 2000Korány, Mednyánszky, et al., 2000Korány, Mednyánszky, et al., 2000
Comment MSDC-RI MSDC-RI MSDC-RI MSDC-RI MSDC-RI
Column type CapillaryCapillaryCapillaryCapillaryCapillary
Active phase DB-WaxDB-WaxHP-InnowaxDB-WaxTC-Wax
Column length (m) 60.60.25.60.60.
Carrier gas HeliumHe He
Substrate
Column diameter (mm) 0.320.250.320.250.25
Phase thickness (μm) 0.250.25
Tstart (C) 50.40.35.50.80.
Tend (C) 230.200.250.200.240.
Heat rate (K/min) 5.2.4.3.3.
Initial hold (min) 2.2.  5.
Final hold (min)    40.
I 1273.1271.1267.1280.1265.
ReferencePaniandy, Chane-Ming, et al., 2000Umano, Hagi, et al., 2000Ong, Acree, et al., 1998Wada and Shibamoto, 1997Shuichi, Masazumi, et al., 1996
Comment MSDC-RI MSDC-RI MSDC-RI MSDC-RI MSDC-RI
Column type CapillaryCapillaryCapillaryCapillaryCapillary
Active phase Supelcowax-10DB-WaxSupelcowax-10Carbowax 20MDB-Wax
Column length (m) 60.30.90.80.60.
Carrier gas HeHydrogenHe He
Substrate
Column diameter (mm) 0.250.320.250.20.322
Phase thickness (μm) 0.250.500.25 0.25
Tstart (C) 40.30.35.70.50.
Tend (C) 200.190.220.170.230.
Heat rate (K/min) 3.3.2.2.4.
Initial hold (min) 3.6.20.
Final hold (min) 30. 30.
I 1279.1277.1270.1307.1270.
ReferenceWong and Lai, 1996Young, Gilbert, et al., 1996Girard and Lau, 1995Anker, Jurs, et al., 1990Engel, Flath, et al., 1988
Comment MSDC-RI MSDC-RI MSDC-RI MSDC-RI MSDC-RI
Column type CapillaryCapillaryCapillaryCapillaryCapillary
Active phase Supelcowax-10Carbowax 20MCarbowax 20MCarbowax 20MCarbowax 20M
Column length (m) 60.50.50.50.50.
Carrier gas  N2N2N2N2
Substrate
Column diameter (mm) 0.320.220.220.220.22
Phase thickness (μm)
Tstart (C) 60.80.80.80.80.
Tend (C) 220.200.200.200.200.
Heat rate (K/min) 3.3.3.3.3.
Initial hold (min) 1.
Final hold (min)
I 1290.1264.1265.1264.1265.
ReferenceHamilton-Kemp, Andersen, et al., 1988Mihara, Tateba, et al., 1988Mihara, Tateba, et al., 1988Mihara, Tateba, et al., 1988Mihara, Tateba, et al., 1988
Comment MSDC-RI MSDC-RI MSDC-RI MSDC-RI MSDC-RI
Column type CapillaryCapillaryCapillaryCapillaryCapillary
Active phase DB-WaxDB-WaxCarbowax 20MCarbowax 20MCarbowax 20M
Column length (m) 60.60.50.50.50.
Carrier gas H2H2N2N2N2
Substrate
Column diameter (mm) 0.250.250.220.220.22
Phase thickness (μm) 0.250.25
Tstart (C) 30.30.80.80.80.
Tend (C) 180.180.200.200.200.
Heat rate (K/min) 2.2.3.3.3.
Initial hold (min) 2.2.
Final hold (min)
I 1272.1272.1264.1265.1264.
ReferenceTakeoka, Flath, et al., 1988Takeoka, Flath, et al., 1988Mihara, Tateba, et al., 1987Mihara, Tateba, et al., 1987Mihara, Tateba, et al., 1987
Comment MSDC-RI MSDC-RI MSDC-RI MSDC-RI MSDC-RI
Column type Capillary
Active phase Carbowax 20M
Column length (m) 50.
Carrier gas N2
Substrate
Column diameter (mm) 0.22
Phase thickness (μm)
Tstart (C) 80.
Tend (C) 200.
Heat rate (K/min) 3.
Initial hold (min)
Final hold (min)
I 1265.
ReferenceMihara, Tateba, et al., 1987
Comment MSDC-RI

Van Den Dool and Kratz RI, non-polar column, temperature ramp

Data compiled by: NIST Mass Spectrometry Data Center, William E. Wallace, director

Column type CapillaryCapillaryCapillaryCapillaryCapillary
Active phase 5 % Phenyl methyl siloxaneSPB-5CP Sil 5 CBDB-1HP-5
Column length (m) 30.30.25.30.30.
Carrier gas  HeHeN2N2
Substrate
Column diameter (mm) 0.250.250.250.320.25
Phase thickness (μm) 0.250.250.40.250.25
Tstart (C) 60.50.60.50.60.
Tend (C) 270.220.260.260.220.
Heat rate (K/min) 15.20.5.2.5.
Initial hold (min)  2. 3.10.
Final hold (min) 15.2.20.5.
I 1025.1014.990.1008.1011.
ReferenceZaikin, 2010Balbontin, Gaete-Eastman, et al., 2007Kafkas, Cabaroglu, et al., 2006Dob, Berramdane, et al., 2005Flamini, Luigi Cioni, et al., 2005
Comment MSDC-RI MSDC-RI MSDC-RI MSDC-RI MSDC-RI
Column type CapillaryCapillaryCapillaryCapillaryCapillary
Active phase HP-5SPB-5SPB-5HP-5DB-1
Column length (m) 30.30.30.30.30.
Carrier gas HeHeHe He
Substrate
Column diameter (mm) 0.250.250.530.250.25
Phase thickness (μm)  0.251.51.0.25
Tstart (C) 60.60.100.-30.40.
Tend (C) 260.250.250.250.250.
Heat rate (K/min) 3.4.5.10.3.
Initial hold (min)  2. 1.
Final hold (min)  20.  20.
I 1008.1008.1006.1014.987.
ReferenceJavidnia, Miri, et al., 2005Pino, Marbot, et al., 2004Rodríguez-Burruezo, Kollmannsberger, et al., 2004Siegmund, Derler, et al., 2004Brat, Rega, et al., 2003
Comment MSDC-RI MSDC-RI MSDC-RI MSDC-RI MSDC-RI
Column type CapillaryCapillaryCapillaryCapillaryCapillary
Active phase Ultra-2DB-5Mega 5MSCP Sil 5 CBCP Sil 5 CB
Column length (m) 25.30.30.25.50.
Carrier gas H2HeHeN2He
Substrate
Column diameter (mm) 0.250.250.250.250.32
Phase thickness (μm) 0.330.250.250.250.4
Tstart (C) 40.60.40.60.60.
Tend (C) 280.240.240.280.280.
Heat rate (K/min) 3.3.3.4.3.
Initial hold (min) 2. 2.6.10.
Final hold (min) 10.   60.
I 1010.1011.1000.989.993.
ReferenceCeva-Antunes, Bizzo, et al., 2003Flamini, Luigi Cioni, et al., 2003Verzera, Trozzi, et al., 2003Pino, Marbot, et al., 2002Pino and Marbot, 2001
Comment MSDC-RI MSDC-RI MSDC-RI MSDC-RI MSDC-RI
Column type CapillaryCapillaryCapillaryCapillaryCapillary
Active phase CP Sil 5 CBHP-5DB-1HP-5Mega 5MS
Column length (m) 50.30.30.30.30.
Carrier gas HeHeH2 He
Substrate
Column diameter (mm) 0.320.250.320.320.25
Phase thickness (μm) 0.4 0.250.250.25
Tstart (C) 60.50.40.40.40.
Tend (C) 280.200.245.280.240.
Heat rate (K/min) 3.4.3.3.3.
Initial hold (min) 10.1.3.4.2.
Final hold (min) 60. 20.
I 993.1013.997.1015.1000.
ReferencePino, Marbot, et al., 2001Shalit, Katzir, et al., 2001Brat, Brillouet, et al., 2000Ruther, 2000Verzera, la Rosa, et al., 2000
Comment MSDC-RI MSDC-RI MSDC-RI MSDC-RI MSDC-RI
Column type CapillaryCapillaryCapillaryCapillaryCapillary
Active phase DB-1DB-5OV-101OV-101DB-5
Column length (m) 60.30.50.50.0.32
Carrier gas HeHeN2N2H2
Substrate
Column diameter (mm) 0.250.250.250.251.
Phase thickness (μm) 0.25
Tstart (C) 50.50.80.80.30.
Tend (C) 220.250.200.200.180.
Heat rate (K/min) 4.4.2.2.1.5
Initial hold (min)     5.
Final hold (min)
I 1002.1010.991.993.1018.
ReferenceMirza and Sefidkon, 1999Gómez, Ledbetter, et al., 1993Yang, Sugisawa, et al., 1992Yang, Sugisawa, et al., 1992Guichard and Souty, 1988
Comment MSDC-RI MSDC-RI MSDC-RI MSDC-RI MSDC-RI
Column type CapillaryCapillaryCapillaryPacked
Active phase SE-30CP Sil 5 CBSE-52SE-30
Column length (m) 25.25.150.
Carrier gas N2 He
Substrate    Celite
Column diameter (mm) 0.300.220.6
Phase thickness (μm)
Tstart (C) 50.70.10.75.
Tend (C)  205.200.228.
Heat rate (K/min) 6.4.1.
Initial hold (min)
Final hold (min)
I 990.996.1018.993.
ReferenceKorhonen, 1984Hendriks and Bruins, 1983de Pooter, Montens, et al., 1983van den Dool and Kratz, 1963
Comment MSDC-RI MSDC-RI MSDC-RI MSDC-RI

Kovats' RI, polar column, custom temperature program

Data compiled by: NIST Mass Spectrometry Data Center, William E. Wallace, director

Column type CapillaryCapillary
Active phase Carbowax 20MCarbowax 20M
Column length (m)
Carrier gas
Substrate
Column diameter (mm)
Phase thickness (μm)
Program not specifiednot specified
I 1279.1280.
ReferenceBrander, Kepner, et al., 1980Brander, Kepner, et al., 1980
Comment MSDC-RI MSDC-RI

References

Vasil'ev and Petrov, 1984
Vasil'ev, I.A.; Petrov, V.M.,
Thermodynamic Properties of Oxygen-containing Organic Compounds, Handbook, Soedinenii: Khimya, Leningrad, p 240, 1984. [all data]
Bilterys and Gisseleire, 1935
Bilterys, R.; Gisseleire, J.,
Investigations on the Congelation Temperature of Organic Compounds,
Bull. Soc. Chim. Belg., 1935, 44, 567. [all data]
Krasnykh, Verevkin, et al., 2006
Krasnykh, Eugen L.; Verevkin, Sergey P.; Koutek, Bohumir; Doubsky, Jan,
Vapour pressures and enthalpies of vaporization of a series of the linear n-alkyl acetates,
The Journal of Chemical Thermodynamics, 2006, 38, 6, 717-723, https://doi.org/10.1016/j.jct.2005.08.003
. [all data]
Koutek, Hoskovec, et al., 1997
Koutek, Bohumír; Hoskovec, Michal; Vrkocová, Pavlína; Feltl, Ladislav,
Gas chromatographic determination of vapour pressures of pheromone-like compounds IV. Acetates, a reinvestigation,
Journal of Chromatography A, 1997, 759, 1-2, 93-109, https://doi.org/10.1016/S0021-9673(96)00775-3
. [all data]
Arce, Blanco, et al., 1995
Arce, Alberto; Blanco, Antonio; Martinez-Ageitos, Jose; Soto, Ana,
Isobaric Vapor-Liquid Equilibria of Methanol + Hexyl Acetate and Ethanol + Hexyl Acetate,
J. Chem. Eng. Data, 1995, 40, 2, 515-518, https://doi.org/10.1021/je00018a036
. [all data]
Stephenson and Malanowski, 1987
Stephenson, Richard M.; Malanowski, Stanislaw,
Handbook of the Thermodynamics of Organic Compounds, 1987, https://doi.org/10.1007/978-94-009-3173-2
. [all data]
Meyer, Awe, et al., 1980
Meyer, Edwin F.; Awe, Michael J.; Wagner, Robert E.,
Cohesive energies in polar organic liquids. 4. n-Alkyl acetates,
J. Chem. Eng. Data, 1980, 25, 4, 371-374, https://doi.org/10.1021/je60087a030
. [all data]
Domalski and Hearing, 1996
Domalski, Eugene S.; Hearing, Elizabeth D.,
Heat Capacities and Entropies of Organic Compounds in the Condensed Phase. Volume III,
J. Phys. Chem. Ref. Data, 1996, 25, 1, 1, https://doi.org/10.1063/1.555985
. [all data]
Wojtyniak and Stone, 1986
Wojtyniak, A.C.M.; Stone, A.J.,
A High-Pressure Mass Spectrometric Study of the Bonding of Trimethylsilylium to Oxygen and Aromatic Bases,
Can. J. Chem., 1986, 74, 59. [all data]