5-Chloro-1-pentyne
- Formula: C5H7Cl
- Molecular weight: 102.562
- IUPAC Standard InChIKey: UXFIKVWAAMKFQE-UHFFFAOYSA-N
- CAS Registry Number: 14267-92-6
- Chemical structure:
View 3d structure (requires JavaScript / HTML 5) - Other names: 1-Pentyne, 5-chloro-; 5-chloropent-1-yne

Phase change data

Data compiled as indicated in comments:
TRC - Thermodynamics Research Center, NIST Boulder Laboratories, Chris Muzny director
BS - Robert L. Brown and Stephen E. Stein
Quantity | Value | Units | Method | Reference | Comment |
---|---|---|---|---|---|
Tboil | 386. | K | N/A | Wotiz, Hollingsworth, et al., 1955 | Uncertainty assigned by TRC = 3. K; TRC |
Tboil | 387. | K | N/A | Campbell, Fatora, et al., 1952 | Uncertainty assigned by TRC = 2. K; TRC |
Tboil | 341.15 | K | N/A | Henne and Greenlee, 1945 | Uncertainty assigned by TRC = 2. K; TRC |
Reduced pressure boiling point
Tboil (K) | Pressure (bar) | Reference | Comment |
---|---|---|---|
340. | 0.193 | Farchan Laboratories, 1990 | BS |

Van Den Dool and Kratz RI, non-polar column, temperature ramp

Column type | Active phase | I | Reference | Comment |
---|---|---|---|---|
Capillary | Petrocol DH | 735. | White, Hackett, et al., 1992 | 100. m/0.25 mm/0.5 μm, He, 1. K/min; Tstart: 30. C; Tend: 220. C |

Normal alkane RI, non-polar column, temperature ramp

Column type | Active phase | I | Reference | Comment |
---|---|---|---|---|
Capillary | OV-101 | 732. | Zenkevich, 2005 | 25. m/0.20 mm/0.10 μm, N2/He, 6. K/min; Tstart: 50. C; Tend: 250. C |

References

Wotiz, Hollingsworth, et al., 1955
Wotiz, J.H.; Hollingsworth, C.A.; Dessy, R.E.,
J. Org. Chem., 1955, 20, 1544. [all data]
Campbell, Fatora, et al., 1952
Campbell, R.H.; Fatora; Campbell, R.H.,
Acetylenic amines: I preparation and base strengths of certain tertiary acetylenic amines,
J. Org. Chem., 1952, 17, 1141. [all data]
Henne and Greenlee, 1945
Henne, A.L.; Greenlee, K.W.,
Preparation and Physical Constants of Acetylenic Compounds,
J. Am. Chem. Soc., 1945, 67, 484-5. [all data]
Farchan Laboratories, 1990
Farchan Laboratories,
Research Chemicals Catalog, Farchan Laboratories, Gainesville, FL, 1990, 91. [all data]
White, Hackett, et al., 1992
White, C.M.; Hackett, J.; Anderson, R.R.; Kail, S.; Spock, P.S.,
Linear temperature programmed retention indices of gasoline range hydrocarbons and chlorinated hydrocarbons on cross-linked polydimethylsiloxane,
J. Hi. Res. Chromatogr., 1992, 15, 2, 105-120, https://doi.org/10.1002/jhrc.1240150211
. [all data]
Zenkevich, 2005
Zenkevich, I.G.,
Experimentally measured retention indices., 2005. [all data]