Propanoic acid, octyl ester
- Formula: C11H22O2
- Molecular weight: 186.2912
- IUPAC Standard InChIKey: CEQGYPPMTKWBIU-UHFFFAOYSA-N
- CAS Registry Number: 142-60-9
- Chemical structure:
View 3d structure (requires JavaScript / HTML 5) - Other names: Propionic acid, octyl ester; n-Octyl propionate; Octyl propionate; n-Octyl propanoate; Octyl propanoate

Phase change data

Data compiled by: Thermodynamics Research Center, NIST Boulder Laboratories, Chris Muzny director
Quantity | Value | Units | Method | Reference | Comment |
---|---|---|---|---|---|
Tboil | 501.08 | K | N/A | Bilterys and Gisseleire, 1935 | Uncertainty assigned by TRC = 0.3 K |
Tboil | 499.6 | K | N/A | Gartenmeister, 1886 | Uncertainty assigned by TRC = 1.5 K |
Quantity | Value | Units | Method | Reference | Comment |
Tfus | 231.6 | K | N/A | Bilterys and Gisseleire, 1935 | Uncertainty assigned by TRC = 0.5 K |

Normal alkane RI, non-polar column, temperature ramp

Data compiled by: NIST Mass Spectrometry Data Center, William E. Wallace, director

Column type CapillaryCapillary
Active phase DB-1Ultra-1
Column length (m) 60.25.
Carrier gas NitrogenHe
Substrate
Column diameter (mm) 0.250.32
Phase thickness (μm) 0.250.25
Tstart (C) 60.80.
Tend (C) 250.260.
Heat rate (K/min) 5.3.
Initial hold (min)
Final hold (min) 10.
I 1282.1286.
ReferenceSonboli, Kanani, et al., 2007Okumura, 1991
Comment MSDC-RI MSDC-RI

References

Bilterys and Gisseleire, 1935
Bilterys, R.; Gisseleire, J.,
Investigations on the Congelation Temperature of Organic Compounds,
Bull. Soc. Chim. Belg., 1935, 44, 567. [all data]
Gartenmeister, 1886
Gartenmeister, R.,
Investigation of the physical characterstics of liquid compounds: vi boiling point and specific volume of normal fatty acid esters,
Justus Liebigs Ann. Chem., 1886, 233, 249-315. [all data]