Sulfur fluoride cation

Gas phase thermochemistry data

Quantity Value Units Method Reference Comment
gas,1 bar311.66J/mol*KReviewChase, 1998Data last reviewed in December, 1976

References

Chase, 1998
Chase, M.W., Jr., NIST-JANAF Themochemical Tables, Fourth Edition, J. Phys. Chem. Ref. Data, Monograph 9, 1998, 1-1951. [all data]