2,2-Bis(phenylthio)propane
- Formula: C15H16S2
- Molecular weight: 260.418
- IUPAC Standard InChIKey: VMXYIOCIINRYCX-UHFFFAOYSA-N
- CAS Registry Number: 14252-46-1
- Chemical structure:
View 3d structure (requires JavaScript / HTML 5) - Permanent link for this species. Use this link for bookmarking this species for future reference.

Gas phase thermochemistry data

Data compiled by: Hussein Y. Afeefy, Joel F. Liebman, and Stephen E. Stein
Quantity | Value | Units | Method | Reference | Comment |
---|---|---|---|---|---|
ΔfH°gas | 262. ± 10. | kJ/mol | Ccb | Steele, Chirico, et al., 1997 | H2SO4 (1:115) |

Condensed phase thermochemistry data

Data compiled by: Hussein Y. Afeefy, Joel F. Liebman, and Stephen E. Stein
Quantity | Value | Units | Method | Reference | Comment |
---|---|---|---|---|---|
ΔfH°solid | 80.0 ± 2.3 | kJ/mol | Ccb | Steele, Chirico, et al., 1997 | H2SO4 (1:115) |
Quantity | Value | Units | Method | Reference | Comment |
ΔcH°solid | -9473.3 ± 2.0 | kJ/mol | Ccb | Steele, Chirico, et al., 1997 | H2SO4 (1:115) |

Phase change data

Data compiled as indicated in comments:
TRC - Thermodynamics Research Center, NIST Boulder Laboratories, Chris Muzny director
ALS - Hussein Y. Afeefy, Joel F. Liebman, and Stephen E. Stein
AC - William E. Acree, Jr., James S. Chickos
Quantity | Value | Units | Method | Reference | Comment |
---|---|---|---|---|---|
Ttriple | 329. | K | N/A | Steele, Chirico, et al., 1997, 2 | Uncertainty assigned by TRC = 2. K; TRC |
Quantity | Value | Units | Method | Reference | Comment |
ΔsubH° | 182. ± 10. | kJ/mol | E | Steele, Chirico, et al., 1997 | H2SO4 (1:115); ALS |
Enthalpy of fusion
ΔfusH (kJ/mol) | Temperature (K) | Reference | Comment |
---|---|---|---|
24.4 | 329. | Steele, Chirico, et al., 1997, 3 | AC |

References

Steele, Chirico, et al., 1997
Steele, W.V.; Chirico, R.D.; Cowell, A.B.; Knipmeyer, S.E.; Nguyen, A.,
Thermodynamic properties and ideal-gas enthalpies of formation for 2-aminoisobutyric acid (2-methylalanine), acetic acid, (4-methyl-3-penten-2-one), 4-methylpent-1-ene, 2,2'-bis(phenylthio)propane, and glycidyl phenyl ether (1,2-epoxy-3-phenoxypropane),
J. Chem. Eng. Data, 1997, 42, 1052-1066. [all data]
Steele, Chirico, et al., 1997, 2
Steele, W.V.; Chirico, R.D.; Cowell, A.B.; Knipmeyer, S.E.; Nguyen, A.,
Thermodynamic Properties and Ideal-Gas Enthalpies of FOrmation for 2-Aminoisobutyric Acid (2-Methylalanine), Acetic Acid, (Z)-5-Ethylidene-2- norbornene, Mesityl Oxide (4-Methyl-3-pentene-2-one), 4-M,
J. Chem. Eng. Data, 1997, 42, 1053-66. [all data]
Steele, Chirico, et al., 1997, 3
Steele, W.V.; Chirico, R.D.; Cowell, A.B.; Knipmeyer, S.E.; Nguyen, A.,
Thermodynamic Properties and Ideal-Gas Enthalpies of Formation for 2-Aminoisobutyric Acid (2-Methylalanine), Acetic Acid, ( Z )-5-Ethylidene-2-norbornene, Mesityl Oxide (4-Methyl-3-penten-2-one), 4-Methylpent-1-ene, 2,2'-Bis(phenylthio)propane, and Glycidyl Phenyl Ether (1,2-Epoxy-3-phenoxypropane),
J. Chem. Eng. Data, 1997, 42, 6, 1053-1066, https://doi.org/10.1021/je970099y
. [all data]
Fehnel and Carmack, 1949
Fehnel, E.A.; Carmack, M.,
J. Am. Chem. Soc., 1949, 71, 84. [all data]