Ethane, 1,1-bis(ethylthio)-
- Formula: C6H14S2
- Molecular weight: 150.305
- IUPAC Standard InChIKey: CIYDRAJJTMIKGP-UHFFFAOYSA-N
- CAS Registry Number: 14252-42-7
- Chemical structure:
View 3d structure (requires JavaScript / HTML 5) - Other names: Acetaldehyde, diethyl mercaptal; Formaldehyde diethylthioacetal; 4-Methyl-3,5-dithiaheptane; 1,1-Bis(ethylsulfanyl)ethane; 1,1-bis(Ethylthio)ethane

Phase change data

Data compiled by: Robert L. Brown and Stephen E. Stein
Quantity | Value | Units | Method | Reference | Comment |
---|---|---|---|---|---|
Tboil | 458. to 460. | K | N/A | Buckingham and Donaghy, 1982 |
Reduced pressure boiling point
Tboil (K) | Pressure (bar) | Reference |
---|---|---|
347. | 0.020 | Buckingham and Donaghy, 1982 |

Kovats' RI, non-polar column, isothermal

Column type | Active phase | Temperature (C) | I | Reference | Comment |
---|---|---|---|---|---|
Packed | Apiezon M | 130. | 1087. | Garbuzov, Misharina, et al., 1985 | He or N2, Chromosorb W, AW-DMCS; Column length: 2.1 m |

References

Buckingham and Donaghy, 1982
Buckingham, J.; Donaghy, S.M.,
Dictionary of Organic Compounds: Fifth Edition, Chapman and Hall, New York, 1982, 1. [all data]
Garbuzov, Misharina, et al., 1985
Garbuzov, V.G.; Misharina, T.A.; Aerov, A.F.; Golovnya, R.V.,
Gas chromatographic retention indices for sulphur(II)-containing organic substances,
J. Anal. Chem. USSR (Engl. Transl.), 1985, 40, 4, 576-586. [all data]