1-heptanol, 2,2-dimethyl-
- Formula: C9H20O
- Molecular weight: 144.2545
- IUPAC Standard InChIKey: WENIXZFPXMQPQQ-UHFFFAOYSA-N
- CAS Registry Number: 14250-79-4
- Chemical structure:
View 3d structure (requires JavaScript / HTML 5) - Species with the same structure:

Phase change data

Data compiled by: Thermodynamics Research Center, NIST Boulder Laboratories, Chris Muzny director
Quantity | Value | Units | Method | Reference | Comment |
---|---|---|---|---|---|
Tboil | 464.92 | K | N/A | Brannock, 1959 | Uncertainty assigned by TRC = 4. K |

References

Brannock, 1959
Brannock, K.C.,
Preparation of substituted 4-pentenals,
J. Am. Chem. Soc., 1959, 81, 3379. [all data]