Octanoic acid, 2,2-dimethyl, methyl ester
- Formula: C11H22O2
- Molecular weight: 186.2912
- IUPAC Standard InChIKey: BAKOMPNQDRRCQN-UHFFFAOYSA-N
- CAS Registry Number: 14250-74-9
- Chemical structure:
View 3d structure (requires JavaScript / HTML 5) - Other names: methyl 2,2-dimethyloctanoate

Kovats' RI, non-polar column, isothermal

Column type | Active phase | Temperature (C) | I | Reference | Comment |
---|---|---|---|---|---|
Packed | Squalane | 120. | 1128. | Schomburg, 1964 |

References

Schomburg, 1964
Schomburg, G.,
Gas-Chromatographische Retentionsdaten und Struktur Chemischer Verbindungen. I. Verzweigte Aliphatische und Alicyclische Carbonsäure-Methylester,
J. Chromatogr., 1964, 14, 157-177, https://doi.org/10.1016/S0021-9673(00)86608-X
. [all data]