Nerolidol
- Formula: C15H26O
- Molecular weight: 222.3663
- IUPAC Standard InChIKey: FQTLCLSUCSAZDY-KAMYIIQDSA-N
- CAS Registry Number: 142-50-7
- Chemical structure:
View 3d structure (requires JavaScript / HTML 5) - Species with the same structure:
- Stereoisomers:
- Other names: 1,6,10-Dodecatrien-3-ol, 3,7,11-trimethyl-, [S-(Z)]-; 1,6,10-Dodecatrien-3-ol, 3,7,11-trimethyl-, (Z)-(S)-(+)-; (+)-Nerolidol; D-Nerolidol; Nerolidol, cis-(+)-; Peruviol; 3,7,11-Trimethyl-1,6,10-dodecatriene-3-ol, (Z)-(S)-(+)-; (6Z)-3,7,11-Trimethyl-1,6,10-dodecatrien-3-ol; 1,6,10-Dodecatrien-3-ol, 3,7,11-trimethyl-, (3S,6Z)-; NSC 60598; (Z)-Nerolidol; cis-Nerolidol; Nerolidol (Z); (Z)-β-Nerolidol; cis-Nerolidol A

Phase change data

Data compiled by: Robert L. Brown and Stephen E. Stein
Quantity | Value | Units | Method | Reference | Comment |
---|---|---|---|---|---|
Tboil | 549.2 | K | N/A | Weast and Grasselli, 1989 |

Normal alkane RI, non-polar column, temperature ramp

Data compiled by: NIST Mass Spectrometry Data Center, William E. Wallace, director

Column type CapillaryCapillaryCapillaryCapillaryCapillary
Active phase HP-5 MSHP-5 MSElite-5 MSHP-5HP-5
Column length (m) 60.30.30.30.30.
Carrier gas HeliumHeliumHeliumHeliumHelium
Substrate
Column diameter (mm) 0.250.250.250.250.25
Phase thickness (μm) 0.250.250.250.250.25
Tstart (C) 40.50.40.50.50.
Tend (C) 250.250.220.300.240.
Heat rate (K/min) 3.5.4.50.3.
Initial hold (min) 1.0.5 5.5.
Final hold (min) 20.0.5 5.
I 1525.1565.1561.1561.1562.
ReferenceSardashti, Valizadeh, et al., 2013Fanaro, Duarte, et al., 2012Baharum, Bunawan, et al., 2010Bi Kouame, Bedi, et al., 2010Monsef-Esfahani, Miri, et al., 2010
Comment MSDC-RI MSDC-RI MSDC-RI MSDC-RI MSDC-RI
Column type CapillaryCapillaryCapillaryCapillaryCapillary
Active phase OV-101OV-101OV-1DB-5DB-5 MS
Column length (m) 50.50.30.30.30.
Carrier gas HeliumHeliumHeliumNitrogenHelium
Substrate
Column diameter (mm) 0.250.250.250.250.25
Phase thickness (μm) 0.250.250.250.250.25
Tstart (C) 70.70.40.40.50.
Tend (C) 220.220.300.230.300.
Heat rate (K/min) 2.2.4.2.5.
Initial hold (min)   2. 5.
Final hold (min)   10. 5.
I 1546.1560.1547.1533.1534.
ReferenceBenites, Moiteiro, et al., 2009Benites, Moiteiro, et al., 2009Nibret and Wink, 2009Scrivanti, Anton, et al., 2009Noudogbessi, Yedomonhan, et al., 2008
Comment MSDC-RI MSDC-RI MSDC-RI MSDC-RI MSDC-RI
Column type CapillaryCapillaryCapillaryCapillaryCapillary
Active phase Col-Elite 5MSCP Sil 5 CBDB-5HP-5DB-1
Column length (m) 30.30.30.30.60.
Carrier gas HeN2 H2N2
Substrate
Column diameter (mm) 0.250.320.250.250.25
Phase thickness (μm) 0.250.250.250.250.25
Tstart (C) 30.50.50.50.60.
Tend (C) 246.300.265.280.250.
Heat rate (K/min) 3.4.2.54.5.
Initial hold (min)   0.52.
Final hold (min)    10.10.
I 1555.1521.1535.1534.1536.
ReferenceGudaityte and Venskutonis R.P., 2007Lis and Milczarek, 2006Nickavar B., Kamalinejad M., et al., 2006Pino, Sauri-Duch, et al., 2006Fakhari A.R., Sonboli A., et al., 2005
Comment MSDC-RI MSDC-RI MSDC-RI MSDC-RI MSDC-RI
Column type CapillaryCapillaryCapillaryCapillaryCapillary
Active phase HP-5RSL-200DB-1DB-1HP-5
Column length (m) 30.30.30.30.30.
Carrier gas He HeHeHe
Substrate
Column diameter (mm) 0.250.250.250.250.25
Phase thickness (μm) 0.250.250.250.250.25
Tstart (C) 60.40.50.50.70.
Tend (C) 30.280.265.265.240.
Heat rate (K/min) 4.6.2.52.55.
Initial hold (min) 3.2.1.1.
Final hold (min) 15.10.20.30.
I 1533.1533.1527.1514.1535.
ReferenceFerretti, Maggi, et al., 2005Jirovetz, Buchbauer, et al., 2005Khanavi, Ghasemian, et al., 2005Khalighi-Sigaroodi, Hadijiakhoondi, et al., 2005Oyedeji, Yani, et al., 2005
Comment MSDC-RI MSDC-RI MSDC-RI MSDC-RI MSDC-RI
Column type CapillaryCapillaryCapillaryCapillaryCapillary
Active phase HP-5MSDB-5HP-5DB-1CP Sil 5 CB
Column length (m) 30.30.30.50.30.
Carrier gas HeHeHelium N2
Substrate
Column diameter (mm) 0.250.250.320.250.25
Phase thickness (μm) 0.250.250.250.250.25
Tstart (C) 60.40.40.60.50.
Tend (C) 275.260.300.240.200.
Heat rate (K/min) 4.2.4.3.5.
Initial hold (min)  5.
Final hold (min)  20.5.
I 1566.1560.1519.1504.1525.
ReferenceSajjadi and Ghannadi, 2005Senatore, Apostolides Arnold, et al., 2005Utsunomia, Kawata, et al., 2005Velasco-Negueruela, Pérez-Alonso, et al., 2005Agnaniet, Menut, et al., 2004
Comment MSDC-RI MSDC-RI MSDC-RI MSDC-RI MSDC-RI
Column type CapillaryCapillaryCapillaryCapillaryCapillary
Active phase DB-1ZB-5DB-1DB-1BPX-5
Column length (m) 60.60.50.50.25.
Carrier gas N2HeHeN2He
Substrate
Column diameter (mm) 0.250.250.220.250.22
Phase thickness (μm) 0.250.250.250.251.
Tstart (C) 70.40.70.95.60.
Tend (C) 230.260.220.240.250.
Heat rate (K/min) 2.6.4.4.3.
Initial hold (min) 2.4.6  5.
Final hold (min) 20.1.  10.
I 1530.1573.1570.1521.1573.
ReferenceChoi, 2004Jürgens and Dötterl, 2004Palá-Paúl, García-Jiménez, et al., 2004Palá-Paúl, Velasco-Negueruela, et al., 2004Vilaseca, Guy, et al., 2004
Comment MSDC-RI MSDC-RI MSDC-RI MSDC-RI MSDC-RI
Column type CapillaryCapillaryCapillaryCapillaryCapillary
Active phase CP Sil 8 CBDB-5DB-5BPX-5HP-5
Column length (m) 30.30.30. 30.
Carrier gas  HeHe N2
Substrate
Column diameter (mm) 0.320.2490.25 0.25
Phase thickness (μm) 0.250.250.25 0.25
Tstart (C) 50.60.60.40.50.
Tend (C) 200.300.280.260.250.
Heat rate (K/min) 5.3.3.5.4.
Initial hold (min) 5.   5.
Final hold (min)   30.
I 1559.1533.1526.1543.1534.
ReferenceWang, Guo, et al., 2004Woerdenbag, Windono, et al., 2004Caredda, Marongiu, et al., 2002Diaz and Kite, 2002Farah, Fechtal. M., et al., 2002
Comment MSDC-RI MSDC-RI MSDC-RI MSDC-RI MSDC-RI
Column type CapillaryCapillaryCapillaryCapillaryCapillary
Active phase CP Sil 5 CBDB-1DB-1SPB-1DB-1
Column length (m) 25.50.30.30.50.
Carrier gas HeN2N2HeHe
Substrate
Column diameter (mm) 0.250.250.250.320.25
Phase thickness (μm)  0.250.250.250.25
Tstart (C) 60.80.80.50.70.
Tend (C) 220.225.225.250.240.
Heat rate (K/min) 5.4.4.2.4.
Initial hold (min)
Final hold (min)
I 1523.1535.1512.1536.1512.
ReferenceMonfared, Davarani, et al., 2002Palá-Paúl, Pérez-Alonso, et al., 2002Palá-Paúl, Pérez-Alonso, et al., 2001Vijayanand, Rao, et al., 2001Palá-Paúl, Pérez-Alonso, et al., 1999
Comment MSDC-RI MSDC-RI MSDC-RI MSDC-RI MSDC-RI
Column type CapillaryCapillaryCapillaryCapillaryCapillary
Active phase SE-30CP Sil 5 CBDB-5 MSMethyl SiliconeMethyl Silicone
Column length (m) 25.25.30.50.50.
Carrier gas HeN2HeliumN2N2
Substrate
Column diameter (mm) 0.20.320.250.250.25
Phase thickness (μm)  0.25 0.170.17
Tstart (C) 60.50.50.80.80.
Tend (C) 180.290.250.200.200.
Heat rate (K/min) 3.4.4.2.3.
Initial hold (min) 10.
Final hold (min)
I 1533.1514.1562.1524.1530.
ReferenceJantan, Ahmad, et al., 1998Bos, Woerdenbag, et al., 1997Gomez and Ledbetter, 1994Gopalakrishnan, Menon, et al., 1993Gopalakrishnan, Menon, et al., 1993
Comment MSDC-RI MSDC-RI MSDC-RI MSDC-RI MSDC-RI
Column type Capillary
Active phase CP Sil 8 CB
Column length (m) 25.
Carrier gas
Substrate
Column diameter (mm) 0.20
Phase thickness (μm)
Tstart (C) 60.
Tend (C) 230.
Heat rate (K/min) 3.
Initial hold (min) 10.
Final hold (min)
I 1569.
ReferenceJantan and Goh, 1990
Comment MSDC-RI

Normal alkane RI, polar column, temperature ramp

Data compiled by: NIST Mass Spectrometry Data Center, William E. Wallace, director

Column type CapillaryCapillaryCapillaryCapillaryCapillary
Active phase Supelcowax-10DB-WaxDB-WaxHP-InnowaxDB-Wax
Column length (m) 30.60.60.30.60.
Carrier gas Helium  HeN2
Substrate
Column diameter (mm) 0.250.250.250.250.25
Phase thickness (μm) 0.250.250.250.170.25
Tstart (C) 70.70.70.60.70.
Tend (C) 220.230.230.210.230.
Heat rate (K/min) 2.2.2.4.2.
Initial hold (min)  2.2.3.2.
Final hold (min)  20.20.15.20.
I 2031.1992.1994.1961.2005.
ReferenceBenites, Moiteiro, et al., 2009Lan Phi N.T., Nishiyama C., et al., 2006Lan Phi N.T., Nishiyama C., et al., 2006Ferretti, Maggi, et al., 2005Njoroge, Koaze, et al., 2005
Comment MSDC-RI MSDC-RI MSDC-RI MSDC-RI MSDC-RI
Column type CapillaryCapillaryCapillaryCapillaryCapillary
Active phase DB-WaxDB-WaxDB-WaxTC-WaxDB-Wax
Column length (m) 60.60.60.60.60.
Carrier gas N2N2N2HeN2
Substrate
Column diameter (mm) 0.250.250.250.250.25
Phase thickness (μm) 0.250.250.25 0.25
Tstart (C) 70.70.70.80.70.
Tend (C) 230.230.230.240.230.
Heat rate (K/min) 2.2.2.3.2.
Initial hold (min) 2.2.2.
Final hold (min) 20.20.20.
I 2005.2014.1997.2034.1995.
ReferenceNjoroge, Koaze, et al., 2005, 2Choi, 2004Choi, 2004, 2Miyazawa, Teranishi, et al., 2003Tu, Thanh, et al., 2002
Comment MSDC-RI MSDC-RI MSDC-RI MSDC-RI MSDC-RI

Kovats' RI, non-polar column, temperature ramp

Data compiled by: NIST Mass Spectrometry Data Center, William E. Wallace, director

Column type CapillaryCapillaryCapillaryCapillaryCapillary
Active phase SPB-1DB-5SPB-1DB-1DB-5
Column length (m) 30.30.30.50.50.
Carrier gas HeHeHeN2He
Substrate
Column diameter (mm) 0.320.250.320.250.32
Phase thickness (μm) 0.250.250.250.250.25
Tstart (C) 60.40.50.95.50.
Tend (C) 240.230.250.240.280.
Heat rate (K/min) 4.8.2.4.5.
Initial hold (min) 4. 2. 2.
Final hold (min) 2.4.5. 10.
I 1543.1527.71543.1546.1554.
ReferenceWalde, Jyothirmayi, et al., 2006Ament K., Kant M.R., et al., 2004Behera, Nagarajan, et al., 2004Velasco-Negueruela, Sanz, et al., 2004Baranauskiene, Venskutonis, et al., 2003
Comment MSDC-RI MSDC-RI MSDC-RI MSDC-RI MSDC-RI
Column type CapillaryCapillaryCapillaryCapillary
Active phase SE-30DB-1OV-1SE-30
Column length (m) 25.30.30.25.
Carrier gas HeHeHeN2
Substrate
Column diameter (mm) 0.220.250.310.2
Phase thickness (μm) 0.250.253.
Tstart (C) 70.40.70.60.
Tend (C) 220.260.280.180.
Heat rate (K/min) 4.2.10.3.
Initial hold (min)  5. 10.
Final hold (min)  20. 1.
I 1532.1543.1585.1533.
ReferencePalá-Paúl, Velasco-Negueruela, et al., 2002Senatore and Rigano, 2001Afsharypuor, Asgary, et al., 1996Jantan, Ahmad, et al., 1996
Comment MSDC-RI MSDC-RI MSDC-RI MSDC-RI

References

Weast and Grasselli, 1989
CRC Handbook of Data on Organic Compounds, 2nd Editon, Weast,R.C and Grasselli, J.G., ed(s)., CRC Press, Inc., Boca Raton, FL, 1989, 1. [all data]