1-Octanol, TMS derivative
- Formula: C11H26OSi
- Molecular weight: 202.4090
- IUPAC Standard InChIKey: CDGIKLPUDRGJQN-UHFFFAOYSA-N
- CAS Registry Number: 14246-16-3
- Chemical structure:
View 3d structure (requires JavaScript / HTML 5) - Other names: Silane, trimethyl(octyloxy)-; Octyl trimethylsilyl ether; Octyloxytrimethylsilane; 1-Octanol, TMS; 1-Octanol, trimethylsilyl ether

Kovats' RI, non-polar column, isothermal

Column type | Active phase | Temperature (C) | I | Reference | Comment |
---|---|---|---|---|---|
Packed | SE-30 | 100. | 1177. | Zarazir, Chovin, et al., 1970 | Chromosorb W; Column length: 2. m |
Packed | SE-30 | 140. | 1177. | Zarazir, Chovin, et al., 1970 | Chromosorb W; Column length: 2. m |

Kovats' RI, polar column, isothermal

Column type | Active phase | Temperature (C) | I | Reference | Comment |
---|---|---|---|---|---|
Packed | Carbowax 20M | 100. | 1200. | Zarazir, Chovin, et al., 1970 | Chromosorb W; Column length: 2. m |
Packed | Carbowax 20M | 140. | 1185. | Zarazir, Chovin, et al., 1970 | Chromosorb W; Column length: 2. m |

Van Den Dool and Kratz RI, non-polar column, custom temperature program

Column type | Active phase | I | Reference | Comment |
---|---|---|---|---|
Capillary | VF-5MS | 1182.6 | Tret'yakov, 2007 | 30. m/0.25 mm/0.25 μm, He; Program: Multi-step temperature program; T(initial)=60C; T(final)=270C |

References

Zarazir, Chovin, et al., 1970
Zarazir, D.; Chovin, P.; Guiochon, G.,
Identification of hydroxylic compounds and their derivatives by gas chromatography,
Chromatographia, 1970, 3, 4, 180-195, https://doi.org/10.1007/BF02269018
. [all data]
Tret'yakov, 2007
Tret'yakov, K.V.,
Retention Data. NIST Mass Spectrometry Data Center., NIST Mass Spectrometry Data Center, 2007. [all data]