2-Butynedioic acid
- Formula: C4H2O4
- Molecular weight: 114.0563
- IUPAC Standard InChIKey: YTIVTFGABIZHHX-UHFFFAOYSA-N
- CAS Registry Number: 142-45-0
- Chemical structure:
View 3d structure (requires JavaScript / HTML 5) - Other names: Acetylenedicarboxylic acid; Butynedioic acid

Phase change data

Data compiled by: Thermodynamics Research Center, NIST Boulder Laboratories, Chris Muzny director
Quantity | Value | Units | Method | Reference | Comment |
---|---|---|---|---|---|
Tfus | 439.65 | K | N/A | Smith and Carlson, 1939 | Uncertainty assigned by TRC = 2.5 K |

Reaction thermochemistry data

Data compiled by: Hussein Y. Afeefy, Joel F. Liebman, and Stephen E. Stein
Individual Reactions
By formula: 2H2 + C4H2O4 = C4H6O4
Quantity | Value | Units | Method | Reference | Comment |
---|---|---|---|---|---|
ΔrH° | -363.2 ± 4.6 | kJ/mol | Chyd | Flitcroft and Skinner, 1958 | solid phase |

References

Smith and Carlson, 1939
Smith, L.I.; Carlson, E.J.,
Prehnitic Acid (Benzene-1,2,3,4-tetracroxylic Acid),
J. Am. Chem. Soc., 1939, 61, 288. [all data]
Flitcroft and Skinner, 1958
Flitcroft, T.L.; Skinner, H.A.,
Heats of hydrogenation Part 2.-Acetylene derivatives,
Trans. Faraday Soc., 1958, 54, 47-53. [all data]