Helium cation
- Formula: He+
- Molecular weight: 4.002053
- CAS Registry Number: 14234-48-1

Gas phase thermochemistry data

Quantity | Value | Units | Method | Reference | Comment |
---|---|---|---|---|---|
S°gas,1 bar | 131.91 | J/mol*K | Review | Chase, 1998 | Data last reviewed in March, 1982 |

Ion clustering data

Data compiled by: Michael M. Meot-Ner (Mautner) and Sharon G. Lias
Clustering reactions
By formula: He+ + He = (He+ • He)
Quantity | Value | Units | Method | Reference | Comment |
---|---|---|---|---|---|
ΔrH° | 228. | kJ/mol | EmSpec | Dehmer and Pratt, 1982 | gas phase |
ΔrH° | 246. | kJ/mol | SCATTERING | Mittman and Weise, 1974 | gas phase |
By formula: (He+ • He) + He = (He+ • 2He)
Quantity | Value | Units | Method | Reference | Comment |
---|---|---|---|---|---|
ΔrH° | 18. | kJ/mol | DT | Patterson, 1968 | gas phase; corrected for ln T term |
Quantity | Value | Units | Method | Reference | Comment |
ΔrS° | 77.0 | J/mol*K | DT | Patterson, 1968 | gas phase; corrected for ln T term |
Free energy of reaction
ΔrG° (kJ/mol) | T (K) | Method | Reference | Comment |
---|---|---|---|---|
-7.9 | 300. | SAMS | Gusinow, Gerber, et al., 1970 | gas phase |
By formula: (He+ • 2He) + He = (He+ • 3He)
Quantity | Value | Units | Method | Reference | Comment |
---|---|---|---|---|---|
ΔrH° | 15.6 ± 0.63 | kJ/mol | PHPMS | Hiraoka and Mori, 1990 | gas phase |
Quantity | Value | Units | Method | Reference | Comment |
ΔrS° | 74.1 | J/mol*K | PHPMS | Hiraoka and Mori, 1990 | gas phase |
Free energy of reaction
ΔrG° (kJ/mol) | T (K) | Method | Reference | Comment |
---|---|---|---|---|
3. | 77. | DT | Helm, 1976 | gas phase |
By formula: (He+ • 3He) + He = (He+ • 4He)
Quantity | Value | Units | Method | Reference | Comment |
---|---|---|---|---|---|
ΔrH° | 2.7 ± 0.63 | kJ/mol | PHPMS | Hiraoka and Mori, 1990 | gas phase |
Quantity | Value | Units | Method | Reference | Comment |
ΔrS° | 53.6 | J/mol*K | PHPMS | Hiraoka and Mori, 1990 | gas phase |
By formula: (He+ • 4He) + He = (He+ • 5He)
Quantity | Value | Units | Method | Reference | Comment |
---|---|---|---|---|---|
ΔrH° | 2.0 ± 0.63 | kJ/mol | PHPMS | Hiraoka and Mori, 1990 | gas phase |
Quantity | Value | Units | Method | Reference | Comment |
ΔrS° | 45.2 | J/mol*K | PHPMS | Hiraoka and Mori, 1990 | gas phase |

Reaction thermochemistry data

Data compiled by: Michael M. Meot-Ner (Mautner) and Sharon G. Lias

Individual Reactions

(He+ • helium) + helium = (He+ • 2helium)

By formula: (He+ • He) + He = (He+ • 2He)

Quantity Value Units Method Reference Comment
Δr4.2kcal/molDTPatterson, 1968gas phase; corrected for ln T term
Quantity Value Units Method Reference Comment
Δr18.4cal/mol*KDTPatterson, 1968gas phase; corrected for ln T term

Free energy of reaction

ΔrG° (kcal/mol) T (K) Method Reference Comment
-1.9300.SAMSGusinow, Gerber, et al., 1970gas phase

(He+ • 2helium) + helium = (He+ • 3helium)

By formula: (He+ • 2He) + He = (He+ • 3He)

Quantity Value Units Method Reference Comment
Δr3.73 ± 0.15kcal/molPHPMSHiraoka and Mori, 1990gas phase
Quantity Value Units Method Reference Comment
Δr17.7cal/mol*KPHPMSHiraoka and Mori, 1990gas phase

Free energy of reaction

ΔrG° (kcal/mol) T (K) Method Reference Comment
0.677.DTHelm, 1976gas phase

(He+ • 3helium) + helium = (He+ • 4helium)

By formula: (He+ • 3He) + He = (He+ • 4He)

Quantity Value Units Method Reference Comment
Δr0.64 ± 0.15kcal/molPHPMSHiraoka and Mori, 1990gas phase
Quantity Value Units Method Reference Comment
Δr12.8cal/mol*KPHPMSHiraoka and Mori, 1990gas phase

(He+ • 4helium) + helium = (He+ • 5helium)

By formula: (He+ • 4He) + He = (He+ • 5He)

Quantity Value Units Method Reference Comment
Δr0.48 ± 0.15kcal/molPHPMSHiraoka and Mori, 1990gas phase
Quantity Value Units Method Reference Comment
Δr10.8cal/mol*KPHPMSHiraoka and Mori, 1990gas phase

He+ + helium = (He+ • helium)

By formula: He+ + He = (He+ • He)

Quantity Value Units Method Reference Comment
Δr54.5kcal/molEmSpecDehmer and Pratt, 1982gas phase
Δr58.8kcal/molSCATTERINGMittman and Weise, 1974gas phase

References

Chase, 1998
Chase, M.W., Jr.,
NIST-JANAF Themochemical Tables, Fourth Edition,
J. Phys. Chem. Ref. Data, Monograph 9, 1998, 1-1951. [all data]
Dehmer and Pratt, 1982
Dehmer, P.M.; Pratt, S.T.,
Photoionization of ArKr, ArXe, and KrXe and bond dissociation energies of the rare gas dimer ions,
J. Chem. Phys., 1982, 77, 4804. [all data]
Mittman and Weise, 1974
Mittman, H.U.; Weise, H.P.,
Scattering of Ions V. Elastic Scattering of the Symmetric Rare Gas Ion - Rare Gas Atom Systems,
Z. Naturforsch., 1974, A29, 400. [all data]
Patterson, 1968
Patterson, P.L.,
Evidence of the Existence of an He3+ Ion,
J. Chem. Phys., 1968, 48, 8, 3625, https://doi.org/10.1063/1.1669660
. [all data]
Gusinow, Gerber, et al., 1970
Gusinow, M.A.; Gerber, R.A.; Gerardo, J.B.,
He3+ and He4+ in 300K Helium Plasmas: Their Effect on Recombination Loss of Electrons,
Phys. Rev. Lett., 1970, 25, 18, 1248, https://doi.org/10.1103/PhysRevLett.25.1248
. [all data]
Hiraoka and Mori, 1990
Hiraoka, K.; Mori, T.,
Stability of Rare - Gas Cluster Ions,
J. Chem. Phys., 1990, 92, 7, 4408, https://doi.org/10.1063/1.457751
. [all data]
Helm, 1976
Helm, H.,
The Mobilities and Equilibrium Reactions of Helium Ions in Helium at 77K,
J. Phys. B, 1976, 9, 7, 1171, https://doi.org/10.1088/0022-3700/9/7/017
. [all data]