C9H11ClO2
- Formula: C9H11ClO2
- Molecular weight: 186.635
- CAS Registry Number: 14233-98-8

Gas phase ion energetics data

Data compiled by: John E. Bartmess
De-protonation reactions
C9H10ClO2- + = C9H11ClO2
By formula: C9H10ClO2- + H+ = C9H11ClO2
Quantity | Value | Units | Method | Reference | Comment |
---|---|---|---|---|---|
ΔrH° | 335.8 ± 2.2 | kcal/mol | G+TS | Taft and Topsom, 1987 | gas phase; value altered from reference due to change in acidity scale |
Quantity | Value | Units | Method | Reference | Comment |
ΔrG° | 328.8 ± 2.0 | kcal/mol | IMRE | Taft and Topsom, 1987 | gas phase; value altered from reference due to change in acidity scale |

Reaction thermochemistry data

Data compiled by: John E. Bartmess

Individual Reactions

C9H10ClO2- + Hydrogen cation = C9H11ClO2

By formula: C9H10ClO2- + H+ = C9H11ClO2

Quantity Value Units Method Reference Comment
Δr335.8 ± 2.2kcal/molG+TSTaft and Topsom, 1987gas phase; value altered from reference due to change in acidity scale
Quantity Value Units Method Reference Comment
Δr328.8 ± 2.0kcal/molIMRETaft and Topsom, 1987gas phase; value altered from reference due to change in acidity scale

References

Taft and Topsom, 1987
Taft, R.W.; Topsom, R.D.,
The Nature and Analysis of Substituent Effects,
Prog. Phys. Org. Chem., 1987, 16, 1. [all data]