Acetamide, N-(2-hydroxyethyl)-
- Formula: C4H9NO2
- Molecular weight: 103.1198
- IUPAC Standard InChIKey: PVCJKHHOXFKFRP-UHFFFAOYSA-N
- CAS Registry Number: 142-26-7
- Chemical structure:
View 3d structure (requires JavaScript / HTML 5) - Other names: β-Hydroxyethylacetamide; Acetylcolamine; N-(β-Hydroxyethyl)acetamide; N-(2-Hydroxyethyl)acetamide; N-Acetylethanolamine; N-Ethanolacetamide; 2-Acetamidoethanol; 2-Acetylaminoethanol; N-Acetyl-2-aminoethanol; Hydroxyethyl acetamide; Acetamide MEA; Amidex AME; Carsamide AMEA; Foamid AME-100; Foamid AME-70; Foamid AME-75; Hetamide MA; Incromectant AMEA-100; Incromectant AMEA-70; Lipamide MEAA; Mackamide AME-100; Schercomid AME 70; Upamide ACMEA; NSC 5999

Phase change data

Data compiled by: Robert L. Brown and Stephen E. Stein
Reduced pressure boiling point
Tboil (K) | Pressure (bar) | Reference |
---|---|---|
426.2 | 0.007 | Aldrich Chemical Company Inc., 1990 |
446. to 449. | 0.020 | Frinton Laboratories Inc., 1986 |

Reaction thermochemistry data

Data compiled by: Hussein Y. Afeefy, Joel F. Liebman, and Stephen E. Stein
Individual Reactions
C6H11NO3 + =
+
By formula: C6H11NO3 + H2O = C4H9NO2 + C2H4O2
Quantity | Value | Units | Method | Reference | Comment |
---|---|---|---|---|---|
ΔrH° | -2.2 ± 0.3 | kJ/mol | Cm | Wadso, 1962 | liquid phase |

References

Aldrich Chemical Company Inc., 1990
Aldrich Chemical Company Inc.,
Catalog Handbook of Fine Chemicals, Aldrich Chemical Company, Inc., Milwaukee WI, 1990, 1. [all data]
Frinton Laboratories Inc., 1986
Frinton Laboratories Inc.,
Catalog Number 11, Frinton Laboratories Inc., Vineland, NJ, 1986, 99. [all data]
Wadso, 1962
Wadso, I.,
Heats of hydrolysis of acetates and thiolacetates in aqueous solution,
Acta Chem. Scand., 1962, 16, 487-494. [all data]