Ethanethioic acid, S-[2-(acetylamino)ethyl] ester

Reaction thermochemistry data

Data compiled by: Hussein Y. Afeefy, Joel F. Liebman, and Stephen E. Stein

Individual Reactions

Ethanethioic acid, S-[2-(acetylamino)ethyl] ester + Water = Acetamide, N-(β-mercaptoethyl)- + Acetic acid

By formula: C6H11NO2S + H2O = C4H9NOS + C2H4O2

Quantity Value Units Method Reference Comment
Δr7.3 ± 0.3kJ/molCmWadso, 1962liquid phase

References

Wadso, 1962
Wadso, I., Heats of hydrolysis of acetates and thiolacetates in aqueous solution, Acta Chem. Scand., 1962, 16, 487-494. [all data]