2-decylnaphthalene
- Formula: C20H28
- Molecular weight: 268.4363
- IUPAC Standard InChIKey: MXUSAGLQYAWTMJ-UHFFFAOYSA-N
- CAS Registry Number: 14188-79-5
- Chemical structure:
View 3d structure (requires JavaScript / HTML 5) - Permanent link for this species. Use this link for bookmarking this species for future reference.

Phase change data

Data compiled by: Thermodynamics Research Center, NIST Boulder Laboratories, Chris Muzny director
Quantity | Value | Units | Method | Reference | Comment |
---|---|---|---|---|---|
Tboil | 637. | K | N/A | Luther, 1955 | Uncertainty assigned by TRC = 5. K |
Quantity | Value | Units | Method | Reference | Comment |
Tfus | 281.0 | K | N/A | Luther, 1955 | Uncertainty assigned by TRC = 3. K |
Tfus | 281.1 | K | N/A | Koelbel, 1949 | Uncertainty assigned by TRC = 2. K |

References

Luther, 1955
Luther, H.,
Private Communication 1955, 1955. [all data]
Koelbel, 1949
Koelbel, H.,
Alkylnaphthalenes as Lubricating-oil Models,
Brennst.-Chem., 1949, 30, 73-80. [all data]