Dibenzo-18-crown-6
- Formula: C20H24O6
- Molecular weight: 360.4010
- IUPAC Standard InChIKey: YSSSPARMOAYJTE-UHFFFAOYSA-N
- CAS Registry Number: 14187-32-7
- Chemical structure:

Condensed phase thermochemistry data

Data compiled by: Hussein Y. Afeefy, Joel F. Liebman, and Stephen E. Stein
Quantity | Value | Units | Method | Reference | Comment |
---|---|---|---|---|---|
ΔfH°solid | -196.6 ± 0.57 | kcal/mol | Ccb | Vasil'ev, Borodin, et al., 1992 | Authors Hf298_condensed=-787.7±2.4 kJ/mol |
Quantity | Value | Units | Method | Reference | Comment |
ΔcH°solid | -2504.3 ± 1.1 | kcal/mol | Ccb | Vasil'ev, Borodin, et al., 1992 | Authors Hf298_condensed=-787.7±2.4 kJ/mol; Corresponding ΔfHºsolid = -196.6 kcal/mol (simple calculation by NIST; no Washburn corrections) |

Phase change data

Data compiled as indicated in comments:
TRC - Thermodynamics Research Center, NIST Boulder Laboratories, Chris Muzny director
AC - William E. Acree, Jr., James S. Chickos
Quantity | Value | Units | Method | Reference | Comment |
---|---|---|---|---|---|
Tfus | 435. | K | N/A | Solov'ev, Govorkova, et al., 1986 | Uncertainty assigned by TRC = 0.2 K; TRC |
Tfus | 434. | K | N/A | Biancheria, Giusti, et al., 1985 | Uncertainty assigned by TRC = 1. K; TRC |
Quantity | Value | Units | Method | Reference | Comment |
ΔvapH° | 32.7 ± 1.8 | kcal/mol | CGC | Nichols, Orf, et al., 2000 | AC |
Quantity | Value | Units | Method | Reference | Comment |
ΔsubH° | 42.7 ± 1.6 | kcal/mol | CGC-DSC | Nichols, Orf, et al., 2000 | AC |
Enthalpy of fusion
ΔfusH (kcal/mol) | Temperature (K) | Reference | Comment |
---|---|---|---|
13.73 | 435.8 | Domanska, 1998 | AC |

Gas phase ion energetics data

Data compiled as indicated in comments:
LBLHLM - Sharon G. Lias, John E. Bartmess, Joel F. Liebman, John L. Holmes, Rhoda D. Levin, and W. Gary Mallard
LLK - Sharon G. Lias, Rhoda D. Levin, and Sherif A. Kafafi

Ionization energy determinations

IE (eV) Method Reference Comment
7.6PEBaker, Armen, et al., 1983LBLHLM
7.8PEBaker, Armen, et al., 1983Vertical value; LBLHLM
7.70PEKajitani, Sugimori, et al., 1979Vertical value; LLK

References

Vasil'ev, Borodin, et al., 1992
Vasil'ev, V.P.; Borodin, V.A.; Kopnyshev, S.B.,
Standard enthalpies of formation of certain crown-ethers,
Russ. J. Phys. Chem. (Engl. Transl.), 1992, 66, 585-587, In original 1104. [all data]
Solov'ev, Govorkova, et al., 1986
Solov'ev, V.P.; Govorkova, L.V.; Raevskii, O.A.,
Determination of the Purity, Melting Point and Heat of Melting of Cyclic Polyethers,
Izv. Akad. Nauk SSSR, Ser. Khim., 1986, No. 3, 691-2. [all data]
Biancheria, Giusti, et al., 1985
Biancheria, A.; Giusti, J.; Paoletti, P.,
Analysis by DSC of the KNCS/dibenzo-18-crown-6 system: phase diagram and enthalpy changes,
Thermochim. Acta, 1985, 90, 109. [all data]
Nichols, Orf, et al., 2000
Nichols, Gary; Orf, Jennifer; Reiter, Sarah M.; Chickos, James; Gokel, George W.,
The vaporization enthalpies of some crown and polyethers by correlation gas chromatography,
Thermochimica Acta, 2000, 346, 1-2, 15-28, https://doi.org/10.1016/S0040-6031(99)00405-0
. [all data]
Domanska, 1998
Domanska, U.,
Measurement and correlation of the solubility of crown ethers in selected organic solvents,
Pol. J. Chem., 1998, 72, 5, 925. [all data]