Butanoyl chloride
- Formula: C4H7ClO
- Molecular weight: 106.551
- IUPAC Standard InChIKey: DVECBJCOGJRVPX-UHFFFAOYSA-N
- CAS Registry Number: 141-75-3
- Chemical structure:
View 3d structure (requires JavaScript / HTML 5) - Other names: Butyryl chloride; n-Butyryl chloride; Butyric acid chloride; Butyric chloride; n-Butyric acid chloride; UN 2353

Phase change data

Data compiled as indicated in comments:
BS - Robert L. Brown and Stephen E. Stein
TRC - Thermodynamics Research Center, NIST Boulder Laboratories, Chris Muzny director
Quantity | Value | Units | Method | Reference | Comment |
---|---|---|---|---|---|
Tboil | 375.2 | K | N/A | Weast and Grasselli, 1989 | BS |
Tboil | 375. | K | N/A | American Tokyo Kasei, 1988 | BS |
Tboil | 377. | K | N/A | Lee, 1966 | Uncertainty assigned by TRC = 8. K; TRC |
Tboil | 374.7 | K | N/A | Percival, Wagner, et al., 1953 | Uncertainty assigned by TRC = 1. K; TRC |
Tboil | 375.0 | K | N/A | Timmermans, 1927 | Uncertainty assigned by TRC = 0.6 K; source of data not clear; TRC |
Quantity | Value | Units | Method | Reference | Comment |
Tfus | 184.2 | K | N/A | Timmermans, 1927 | Uncertainty assigned by TRC = 0.6 K; TRC |
Tfus | 184.2 | K | N/A | Timmermans and Mattaar, 1921 | Uncertainty assigned by TRC = 1. K; TRC |

Condensed phase thermochemistry data

Data compiled by: Eugene S. Domalski and Elizabeth D. Hearing

Constant pressure heat capacity of liquid

Cp,liquid (J/mol*K) Temperature (K) Reference Comment
170.7298.von Reis, 1881T = 290 to 390 K.

Van Den Dool and Kratz RI, non-polar column, custom temperature program

Data compiled by: NIST Mass Spectrometry Data Center, William E. Wallace, director

Column type Capillary
Active phase VF-5MS
Column length (m) 30.
Carrier gas He
Substrate
Column diameter (mm) 0.25
Phase thickness (μm) 0.25
Program Multi-step temperature program; T(initial)=60C; T(final)=270C
I 709.1
ReferenceTret'yakov, 2007
Comment MSDC-RI

References

Weast and Grasselli, 1989
CRC Handbook of Data on Organic Compounds, 2nd Editon, Weast,R.C and Grasselli, J.G., ed(s)., CRC Press, Inc., Boca Raton, FL, 1989, 1. [all data]
American Tokyo Kasei, 1988
American Tokyo Kasei,
TCI American Organic Chemical 88/89 Catalog, American Tokyo Kasei, Portland, OR, 1988, 1610. [all data]
Lee, 1966
Lee, J.B.,
Preparation of Acyl Halides under Very Mild Conditions,
J. Am. Chem. Soc., 1966, 88, 3440-1. [all data]
Percival, Wagner, et al., 1953
Percival, W.C.; Wagner, R.B.; Cook, N.C.,
J. Am. Chem. Soc., 1953, 75, 3731. [all data]
Timmermans, 1927
Timmermans, J.,
The Melting Point of Organic Substances,
Bull. Soc. Chim. Belg., 1927, 36, 502. [all data]
Timmermans and Mattaar, 1921
Timmermans, J.; Mattaar, J.F.,
Freezing points of orgainic substances VI. New experimental determinations.,
Bull. Soc. Chim. Belg., 1921, 30, 213. [all data]