Dibenzo-24-crown-8
- Formula: C24H32O8
- Molecular weight: 448.5061
- IUPAC Standard InChIKey: UNTITLLXXOKDTB-UHFFFAOYSA-N
- CAS Registry Number: 14174-09-5
- Chemical structure:

Phase change data

Data compiled as indicated in comments:
TRC - Thermodynamics Research Center, NIST Boulder Laboratories, Chris Muzny director
AC - William E. Acree, Jr., James S. Chickos
Quantity | Value | Units | Method | Reference | Comment |
---|---|---|---|---|---|
Tfus | 381.41 | K | N/A | Solov'ev, Govorkova, et al., 1986 | Crystal phase 1 phase; Uncertainty assigned by TRC = 0.3 K; TRC |
Enthalpy of fusion
ΔfusH (kJ/mol) | Temperature (K) | Reference | Comment |
---|---|---|---|
52.25 | 375.4 | Domanska, 1998 | See also Raewskii, Solov'ev, et al., 1985.; AC |

References

Solov'ev, Govorkova, et al., 1986
Solov'ev, V.P.; Govorkova, L.V.; Raevskii, O.A.,
Determination of the Purity, Melting Point and Heat of Melting of Cyclic Polyethers,
Izv. Akad. Nauk SSSR, Ser. Khim., 1986, No. 3, 691-2. [all data]
Domanska, 1998
Domanska, U.,
Measurement and correlation of the solubility of crown ethers in selected organic solvents,
Pol. J. Chem., 1998, 72, 5, 925. [all data]
Raewskii, Solov'ev, et al., 1985
Raewskii, O.A.; Solov'ev, B.P.; Govorkova, L.W.,
Zh. Obshch. Khim., 1985, 55, 1381. [all data]