1,4,7,10-Benzotetraoxacyclododecin, 2,3,5,6,8,9-hexahydro-
- Formula: C12H16O4
- Molecular weight: 224.2530
- IUPAC Standard InChIKey: OAJNZFCPJVBYHB-UHFFFAOYSA-N
- CAS Registry Number: 14174-08-4
- Chemical structure:

Phase change data

Data compiled by: William E. Acree, Jr., James S. Chickos
Quantity | Value | Units | Method | Reference | Comment |
---|---|---|---|---|---|
ΔvapH° | 82.7 ± 2.3 | kJ/mol | CGC | Nichols, Orf, et al., 2000 | |
Quantity | Value | Units | Method | Reference | Comment |
ΔsubH° | 104.3 ± 2.6 | kJ/mol | CGC-DSC | Nichols, Orf, et al., 2000 |

References

Nichols, Orf, et al., 2000
Nichols, Gary; Orf, Jennifer; Reiter, Sarah M.; Chickos, James; Gokel, George W.,
The vaporization enthalpies of some crown and polyethers by correlation gas chromatography,
Thermochimica Acta, 2000, 346, 1-2, 15-28, https://doi.org/10.1016/S0040-6031(99)00405-0
. [all data]