4-Methoxy-4-methyl-2-pentanol
- Formula: C7H16O2
- Molecular weight: 132.2007
- IUPAC Standard InChIKey: OMSLSFZIEVFEIH-UHFFFAOYSA-N
- CAS Registry Number: 141-73-1
- Chemical structure:
View 3d structure (requires JavaScript / HTML 5) - Other names: 2-Pentanol, 4-methoxy-4-methyl-; 4-Methyl-4-methoxy-2-pentanol

Phase change data

Data compiled by: William E. Acree, Jr., James S. Chickos
Enthalpy of vaporization
ΔvapH (kJ/mol) | Temperature (K) | Method | Reference | Comment |
---|---|---|---|---|
46.6 | 358. | A | Stephenson and Malanowski, 1987 | Based on data from 343. to 423. K. See also Kkykj and Repas, 1973. |

References

Stephenson and Malanowski, 1987
Stephenson, Richard M.; Malanowski, Stanislaw,
Handbook of the Thermodynamics of Organic Compounds, 1987, https://doi.org/10.1007/978-94-009-3173-2
. [all data]
Kkykj and Repas, 1973
Kkykj, J.; Repas, M.,
Petrochemia, 1973, 13, 179. [all data]