Heptane, 2,2,6,6-tetramethyl-4-methylene-
- Formula: C12H24
- Molecular weight: 168.3190
- IUPAC Standard InChIKey: TUFZRYOCZCLYJO-UHFFFAOYSA-N
- CAS Registry Number: 141-70-8
- Chemical structure:
View 3d structure (requires JavaScript / HTML 5) - Other names: 4,4-Dimethyl-2-neopentyl-1-pentene; 2-(2,2-dimethylpropyl)-4,4-dimethylpent-1-ene

Phase change data

Data compiled by: Thermodynamics Research Center, NIST Boulder Laboratories, Chris Muzny director
Quantity | Value | Units | Method | Reference | Comment |
---|---|---|---|---|---|
Tfus | 248. | K | N/A | Brown and Berneis, 1953 | Uncertainty assigned by TRC = 3. K |
Tfus | 249.6 | K | N/A | Pattison and Carmack, 1946 | Uncertainty assigned by TRC = 1. K |

References

Brown and Berneis, 1953
Brown, H.C.; Berneis, H.L.,
J. Am. Chem. Soc., 1953, 75, 10. [all data]
Pattison and Carmack, 1946
Pattison, D.B.; Carmack, M.,
J. Am. Chem. Soc., 1946, 68, 2033. [all data]