Pentasiloxane, dodecamethyl-
- Formula: C12H36O4Si5
- Molecular weight: 384.8393
- IUPAC Standard InChIKey: FBZANXDWQAVSTQ-UHFFFAOYSA-N
- CAS Registry Number: 141-63-9
- Chemical structure:
View 3d structure (requires JavaScript / HTML 5) - Other names: Dodecamethylpentasiloxane; 1,1,1,3,3,5,5,7,7,9,9,9-Dodecamethylpentasiloxane

Phase change data

Data compiled by: William E. Acree, Jr., James S. Chickos
Enthalpy of vaporization
ΔvapH (kJ/mol) | Temperature (K) | Method | Reference | Comment |
---|---|---|---|---|
50.3 | 404. | A | Stephenson and Malanowski, 1987 | Based on data from 389. to 498. K. See also Skorokhodov, Ditsent, et al., 1971. |
55.4 | 410. | EB | Flaningam, 1986 | Based on data from 395. to 515. K. |

Van Den Dool and Kratz RI, non-polar column, custom temperature program

Column type | Active phase | I | Reference | Comment |
---|---|---|---|---|
Capillary | VF-5MS | 1202.9 | Tret'yakov, 2008 | 30. m/0.25 mm/0.25 μm, He; Program: Multi-step temperature program; T(initial)=60C; T(final)=270C |

References

Stephenson and Malanowski, 1987
Stephenson, Richard M.; Malanowski, Stanislaw,
Handbook of the Thermodynamics of Organic Compounds, 1987, https://doi.org/10.1007/978-94-009-3173-2
. [all data]
Skorokhodov, Ditsent, et al., 1971
Skorokhodov, I.I.; Ditsent, V.E.; Teret'eva, N.A.; Zolotarev, M.N.,
Russ. J. Phys. Chem., 1971, 45, 6, 902. [all data]
Flaningam, 1986
Flaningam, Ora L.,
Vapor pressures of poly(dimethylsiloxane) oligomers,
J. Chem. Eng. Data, 1986, 31, 3, 266-272, https://doi.org/10.1021/je00045a002
. [all data]
Tret'yakov, 2008
Tret'yakov, K.V.,
Retention Data. NIST Mass Spectrometry Data Center., NIST Mass Spectrometry Data Center, 2008. [all data]