Perfluoroadamantanone

Reaction thermochemistry data

Data compiled by: Hussein Y. Afeefy, Joel F. Liebman, and Stephen E. Stein

Individual Reactions

Perfluoroadamantanone + Methyl Alcohol = Tricyclo[3.3.1.1(3,7)]decan-2-ol, 1,3,4,4,5,6,6,7,8,8,9,9,10,10-tetradecafluoro-2-methoxy-

By formula: C10F14O + CH4O = C11H4F14O2

Quantity Value Units Method Reference Comment
Δr-35.3kJ/molEqkAdcock and Luo, 1992liquid phase; solvent: CFCl3

References

Adcock and Luo, 1992
Adcock, J.L.; Luo, H., Synthesis and nucleophilic and photochemical reactions of F-adamantanone, J. Org. Chem., 1992, 57, 4297-4300. [all data]