bis(8-hydroxy-2-methylquinolinate)zinc(II)
- Formula: C20H16N2O2Zn
- Molecular weight: 381.73
- CAS Registry Number: 14128-73-5

Phase change data

Data compiled by: William E. Acree, Jr., James S. Chickos
Quantity | Value | Units | Method | Reference | Comment |
---|---|---|---|---|---|
ΔsubH° | 179.4 ± 5.0 | kJ/mol | N/A | Ribeiro da Silva, Matos, et al., 1998 |
Enthalpy of sublimation
ΔsubH (kJ/mol) | Temperature (K) | Method | Reference | Comment |
---|---|---|---|---|
172.0 ± 5.0 | 541. | ME | Ribeiro da Silva, Matos, et al., 1998 | Based on data from 437. to 556. K. |

References

Ribeiro da Silva, Matos, et al., 1998
Ribeiro da Silva, Manuel A.V.; Matos, M. Agostinha R.; Gonçalves, Jorge M.,
Standard molar enthalpies of formation and sublimation of some crystalline bis(8-hydroxy-2-methylquinolinate) metal complexes,
The Journal of Chemical Thermodynamics, 1998, 30, 3, 299-310, https://doi.org/10.1006/jcht.1997.0299
. [all data]