Calcium, doubly charged positive ion
- Formula: Ca+2
- Molecular weight: 40.077
- CAS Registry Number: 14127-61-8

Ion clustering data

Data compiled by: Michael M. Meot-Ner (Mautner) and Sharon G. Lias
Clustering reactions
(Ca+2 • 4 •
) +
= (Ca+2 • 5
•
)
By formula: (Ca+2 • 4CO2 • CCaO3) + CO2 = (Ca+2 • 5CO2 • CCaO3)
Free energy of reaction
ΔrG° (kJ/mol) | T (K) | Method | Reference | Comment |
---|---|---|---|---|
32. | 296. | FA | Spears and Fehsenfeld, 1972 | gas phase |
By formula: (Ca+2 • 5CO2) + CO2 = (Ca+2 • 6CO2)
Free energy of reaction
ΔrG° (kJ/mol) | T (K) | Method | Reference | Comment |
---|---|---|---|---|
34. | 296. | FA | Spears and Fehsenfeld, 1972 | gas phase |
By formula: (Ca+2 • 8H2O) + H2O = (Ca+2 • 9H2O)
Quantity | Value | Units | Method | Reference | Comment |
---|---|---|---|---|---|
ΔrH° | 60. ± 10. | kJ/mol | HPMS | Blades, Jayaweera, et al., 1990 | gas phase; electrospray, Entropy change calculated or estimated |
Quantity | Value | Units | Method | Reference | Comment |
ΔrS° | 96. | J/mol*K | N/A | Blades, Jayaweera, et al., 1990 | gas phase; electrospray, Entropy change calculated or estimated |
Free energy of reaction
ΔrG° (kJ/mol) | T (K) | Method | Reference | Comment |
---|---|---|---|---|
33. | 300. | HPMS | Blades, Jayaweera, et al., 1990 | gas phase; electrospray, Entropy change calculated or estimated |
By formula: (Ca+2 • 9H2O) + H2O = (Ca+2 • 10H2O)
Quantity | Value | Units | Method | Reference | Comment |
---|---|---|---|---|---|
ΔrH° | 60. ± 10. | kJ/mol | HPMS | Blades, Jayaweera, et al., 1990 | gas phase; electrospray, Entropy change calculated or estimated |
Quantity | Value | Units | Method | Reference | Comment |
ΔrS° | 96. | J/mol*K | N/A | Blades, Jayaweera, et al., 1990 | gas phase; electrospray, Entropy change calculated or estimated |
Free energy of reaction
ΔrG° (kJ/mol) | T (K) | Method | Reference | Comment |
---|---|---|---|---|
32. | 300. | HPMS | Blades, Jayaweera, et al., 1990 | gas phase; electrospray, Entropy change calculated or estimated |
By formula: (Ca+2 • 10H2O) + H2O = (Ca+2 • 11H2O)
Quantity | Value | Units | Method | Reference | Comment |
---|---|---|---|---|---|
ΔrH° | 60. ± 10. | kJ/mol | HPMS | Blades, Jayaweera, et al., 1990 | gas phase; electrospray, Entropy change calculated or estimated |
Quantity | Value | Units | Method | Reference | Comment |
ΔrS° | 96. | J/mol*K | N/A | Blades, Jayaweera, et al., 1990 | gas phase; electrospray, Entropy change calculated or estimated |
Free energy of reaction
ΔrG° (kJ/mol) | T (K) | Method | Reference | Comment |
---|---|---|---|---|
30. | 300. | HPMS | Blades, Jayaweera, et al., 1990 | gas phase; electrospray, Entropy change calculated or estimated |
By formula: (Ca+2 • 11H2O) + H2O = (Ca+2 • 12H2O)
Quantity | Value | Units | Method | Reference | Comment |
---|---|---|---|---|---|
ΔrH° | 60. ± 10. | kJ/mol | HPMS | Blades, Jayaweera, et al., 1990 | gas phase; electrospray, Entropy change calculated or estimated |
Quantity | Value | Units | Method | Reference | Comment |
ΔrS° | 96. | J/mol*K | N/A | Blades, Jayaweera, et al., 1990 | gas phase; electrospray, Entropy change calculated or estimated |
Free energy of reaction
ΔrG° (kJ/mol) | T (K) | Method | Reference | Comment |
---|---|---|---|---|
29. | 300. | HPMS | Blades, Jayaweera, et al., 1990 | gas phase; electrospray, Entropy change calculated or estimated |

Reaction thermochemistry data

Data compiled by: Michael M. Meot-Ner (Mautner) and Sharon G. Lias

Individual Reactions

(Ca+2 • 10Water) + Water = (Ca+2 • 11Water)

By formula: (Ca+2 • 10H2O) + H2O = (Ca+2 • 11H2O)

Quantity Value Units Method Reference Comment
Δr60. ± 10.kJ/molHPMSBlades, Jayaweera, et al., 1990gas phase; electrospray, Entropy change calculated or estimated
Quantity Value Units Method Reference Comment
Δr96.J/mol*KN/ABlades, Jayaweera, et al., 1990gas phase; electrospray, Entropy change calculated or estimated

Free energy of reaction

ΔrG° (kJ/mol) T (K) Method Reference Comment
30.300.HPMSBlades, Jayaweera, et al., 1990gas phase; electrospray, Entropy change calculated or estimated

(Ca+2 • 11Water) + Water = (Ca+2 • 12Water)

By formula: (Ca+2 • 11H2O) + H2O = (Ca+2 • 12H2O)

Quantity Value Units Method Reference Comment
Δr60. ± 10.kJ/molHPMSBlades, Jayaweera, et al., 1990gas phase; electrospray, Entropy change calculated or estimated
Quantity Value Units Method Reference Comment
Δr96.J/mol*KN/ABlades, Jayaweera, et al., 1990gas phase; electrospray, Entropy change calculated or estimated

Free energy of reaction

ΔrG° (kJ/mol) T (K) Method Reference Comment
29.300.HPMSBlades, Jayaweera, et al., 1990gas phase; electrospray, Entropy change calculated or estimated

(Ca+2 • 9Water) + Water = (Ca+2 • 10Water)

By formula: (Ca+2 • 9H2O) + H2O = (Ca+2 • 10H2O)

Quantity Value Units Method Reference Comment
Δr60. ± 10.kJ/molHPMSBlades, Jayaweera, et al., 1990gas phase; electrospray, Entropy change calculated or estimated
Quantity Value Units Method Reference Comment
Δr96.J/mol*KN/ABlades, Jayaweera, et al., 1990gas phase; electrospray, Entropy change calculated or estimated

Free energy of reaction

ΔrG° (kJ/mol) T (K) Method Reference Comment
32.300.HPMSBlades, Jayaweera, et al., 1990gas phase; electrospray, Entropy change calculated or estimated

(Ca+2 • 8Water) + Water = (Ca+2 • 9Water)

By formula: (Ca+2 • 8H2O) + H2O = (Ca+2 • 9H2O)

Quantity Value Units Method Reference Comment
Δr60. ± 10.kJ/molHPMSBlades, Jayaweera, et al., 1990gas phase; electrospray, Entropy change calculated or estimated
Quantity Value Units Method Reference Comment
Δr96.J/mol*KN/ABlades, Jayaweera, et al., 1990gas phase; electrospray, Entropy change calculated or estimated

Free energy of reaction

ΔrG° (kJ/mol) T (K) Method Reference Comment
33.300.HPMSBlades, Jayaweera, et al., 1990gas phase; electrospray, Entropy change calculated or estimated

(Ca+2 • 4Carbon dioxide • Calcium carbonate (precipitated)) + Carbon dioxide = (Ca+2 • 5Carbon dioxide • Calcium carbonate (precipitated))

By formula: (Ca+2 • 4CO2 • CCaO3) + CO2 = (Ca+2 • 5CO2 • CCaO3)

Free energy of reaction

ΔrG° (kJ/mol) T (K) Method Reference Comment
32.296.FASpears and Fehsenfeld, 1972gas phase

(Ca+2 • 5Carbon dioxide) + Carbon dioxide = (Ca+2 • 6Carbon dioxide)

By formula: (Ca+2 • 5CO2) + CO2 = (Ca+2 • 6CO2)

Free energy of reaction

ΔrG° (kJ/mol) T (K) Method Reference Comment
34.296.FASpears and Fehsenfeld, 1972gas phase

References

Spears and Fehsenfeld, 1972
Spears, K.G.; Fehsenfeld, F.C.,
Termolecular Association Reactions of Mg, Ca, and Ba Ions,
J. Chem. Phys., 1972, 56, 11, 5698, https://doi.org/10.1063/1.1677091
. [all data]
Blades, Jayaweera, et al., 1990
Blades, A.T.; Jayaweera, P.; Ikonomou, M.G.; Kebarle, P.,
Studies of Alkaline - Earth and Transition - Metal M++ Gas - Phase Ion Chemistry,
J. Chem. Phys., 1990, 92, 10, 5900, https://doi.org/10.1063/1.458360
. [all data]