2,6-Octadien-1-ol, 3,7-dimethyl-, acetate, (Z)-
- Formula: C12H20O2
- Molecular weight: 196.2860
- IUPAC Standard InChIKey: HIGQPQRQIQDZMP-FLIBITNWSA-N
- CAS Registry Number: 141-12-8
- Chemical structure:
View 3d structure (requires JavaScript / HTML 5) - Stereoisomers:
- Other names: Nerol acetate; Neryl acetate; cis-Geranyl acetate; (2Z)-3,7-Dimethyl-2,6-octadienyl acetate; (Z)-3,7-Dimethyl-2,6-octadien-1-ol, acetate

Phase change data

Data compiled by: Robert L. Brown and Stephen E. Stein
Reduced pressure boiling point
Tboil (K) | Pressure (bar) | Reference |
---|---|---|
407.2 | 0.033 | Weast and Grasselli, 1989 |

Normal alkane RI, non-polar column, custom temperature program

Data compiled by: NIST Mass Spectrometry Data Center, William E. Wallace, director

Column type CapillaryCapillaryCapillaryCapillaryCapillary
Active phase RTX-1HP-5 MSSiloxane, 5 % PhDB-5HP-5 MS
Column length (m) 60.30. 60.30.
Carrier gas HeliumHelium HeliumHelium
Substrate
Column diameter (mm) 0.220.25 0.250.25
Phase thickness (μm) 0.250.25 1.000.25
Program not specified40 0C (10 min) 3 0C/min -> 200 0C 2 0C/min -> 220 0Cnot specified40 0C 4 0C/min -> 230 0C 100 0C/min -> 260 0C (11.7 min)40 0C (10 min) 3 0C/min -> 200 0C 2 0C/min -> 220 0C
I 1335.1365.1363.1350.1365.
ReferenceBendiabdellah, El Amine Dib, et al., 2012Sharopov, Sulaimonova, et al., 2012VOC BinBase, 2012Miyazaki, Plotto, et al., 2011Nance and Setzer, 2011
Comment MSDC-RI MSDC-RI MSDC-RI MSDC-RI MSDC-RI
Column type CapillaryCapillaryCapillaryCapillaryCapillary
Active phase Polydimethyl siloxane, 5 % phenylRTX-1RTX-1DB-1-MSHP-5 MS
Column length (m)  60.60.60.60.
Carrier gas  HeliumHeliumHeliumHelium
Substrate
Column diameter (mm)  0.220.220.250.32
Phase thickness (μm)  0.250.250.251.0
Program not specifiednot specifiednot specifiednot specified120 0C 2 0C/min -> 240 0C 10 0C/min -> 270 0C (2 min)
I 1363.1336.1336.1342.1365.
ReferenceSkogerson, Wohlgemuth, et al., 2011Dib, Djabou, et al., 2010Dib, Djabou, et al., 2010Takeoka, Hobbs, et al., 2010Dharmawan, Kasapis, et al., 2009
Comment MSDC-RI MSDC-RI MSDC-RI MSDC-RI MSDC-RI
Column type CapillaryCapillaryCapillaryCapillaryCapillary
Active phase DB-5DB-5HP-5SLB-5 MSHP-5MS
Column length (m) 30.30.30.30.30.
Carrier gas HeliumHelium HeliumHe
Substrate
Column diameter (mm) 0.250.250.320.250.25
Phase thickness (μm) 0.250.25 0.250.25
Program not specifiednot specifiednot specifiednot specified40 0C (2 min) 3 0C/min -> 180 0C (2 min) 15 0C -> 280 0C
I 1362.1371.1366.1361.1340.
ReferencePorto, Decorti, et al., 2009Porto, Decorti, et al., 2009Riahi, Pourbasheer, et al., 2009Lo Presti, Sciarrone, et al., 2008Ning, Zheng, et al., 2008
Comment MSDC-RI MSDC-RI MSDC-RI MSDC-RI MSDC-RI
Column type CapillaryCapillaryCapillaryCapillaryCapillary
Active phase HP-5HP-5RTX-5RTX-5CBP-5
Column length (m) 30.30.30.30.30.
Carrier gas HeliumHeliumHeliumHeliumHe
Substrate
Column diameter (mm) 0.250.250.250.250.25
Phase thickness (μm) 0.250.250.250.250.25
Program 40 0C (3 min) 3 0C/min -> 160 0C (2 min) 8 0C/min -> 220 0C (3 min)not specified60 0C (5 min) 5 0C/min -> 110 0C 3 0C/min -> 220 0C (5 min)not specified60C(2min) => 3C/min => 240C => 10C/min => 300C
I 1365.1376.1365.1362.1380.
ReferenceQiao, Xie, et al., 2008Qiao, Xie, et al., 2008Zachariah, Leela, et al., 2008Zachariah, Leela, et al., 2008Cheriti, Saad, et al., 2007
Comment MSDC-RI MSDC-RI MSDC-RI MSDC-RI MSDC-RI
Column type CapillaryCapillaryCapillaryCapillaryCapillary
Active phase DB-5HP-5 MSHP-5 MSSPB-5HP-5
Column length (m) 30.30.30.60.30.
Carrier gas HydrogenHeliumHeliumHeHe
Substrate
Column diameter (mm) 0.250.250.250.320.25
Phase thickness (μm) 0.25 0.251.0.25
Program not specified40 0C (10 min) 3 oC/min -> 200 0C 2 0C/min -> 220 0Cnot specified60C => 1C/min => 130C => 2C/min => 200C => 4C/min => 250C(40min)60C(4min) => 1C/min => 64C => 2.5C/min => 155C => 5C/min => 250C
I 1365.1360.1341.1377.1366.
ReferencePontes, de Olivera, et al., 2007Setzer, Stokes, et al., 2007Sharififar, Mozaffarian, et al., 2007Iriti, Colnaghi, et al., 2006Jordan, Martinez, et al., 2006
Comment MSDC-RI MSDC-RI MSDC-RI MSDC-RI MSDC-RI
Column type CapillaryCapillaryCapillaryCapillaryCapillary
Active phase HP-5MSHP-5MSSE-52DB-5MSDB-5MS
Column length (m) 30.30.30.30.30.
Carrier gas HeHeHeHe
Substrate
Column diameter (mm) 0.250.320.320.250.25
Phase thickness (μm) 0.250.250.150.250.25
Program 40C(5min) => 2C/min => 250C (15min) => 10C/min => 270C60C(1min) => 1.5C => 185C => 9C/min => 275C (2min)45C => 1C/min => 100C => 5C/min => 250C (10min)60C => 3C/min => 180C => 250C (2min)70C(2min) => 10C/min => 150C(15min) => 5C/min => 240C
I 1359.1366.1362.1366.1347.
ReferenceSenatore, Apostolides Arnold, et al., 2006Singh G., Maurya S., et al., 2006Tognolini, Barocelli, et al., 2006Tuberoso, Barra, et al., 2006Bagci and Baser, 2005
Comment MSDC-RI MSDC-RI MSDC-RI MSDC-RI MSDC-RI
Column type CapillaryCapillaryCapillaryCapillaryCapillary
Active phase DB-5CP-Sil5 CB MSBPX-5DB-5
Column length (m) 30.50.30.30.
Carrier gas He HeHe
Substrate
Column diameter (mm) 0.250.320.320.25
Phase thickness (μm) 0.251.20.50.1
Program 40C(1min) => 9C/min => 130C => 2C/min => 230C36C(2min) => 20C/min => 85C => 1C/min => 145C => 3C/min => 250C(30min)60C(1min) => 3.5C/min => 180C => 20C/min => 280C(2min)35C => 4C/min => 180C => 10C/min => 250Cnot specified
I 1375.1352.1365.1353.1352.
ReferenceHamm, Bleton, et al., 2005Iraqi, Vermeulen, et al., 2005Koutsoudaki, Krsek, et al., 2005Albuquerque, Souza, et al., 2004El-Shazily, Hafez, et al., 2004
Comment MSDC-RI MSDC-RI MSDC-RI MSDC-RI MSDC-RI
Column type CapillaryCapillaryCapillaryCapillaryCapillary
Active phase OV-1CP Sil 8 CBHP-5DB-5SE-30
Column length (m) 30.50.30.
Carrier gas HeHeHe
Substrate
Column diameter (mm) 0.250.320.25
Phase thickness (μm) 0.250.250.25
Program 45 0C (4 min) 3 0C/min -> 75 0C 4 0C/min -> 115 0C 6 0C/min -> 312 0C60C(2min) => 5C/min => 160C(1min) => 10C/min => 250C (5min)60C(4min) => 1C/min => 64C => 2.5C/min => 155C => 5C/min => 250Cnot specifiednot specified
I 1353.1365.1366.1365.1343.
ReferenceHafez and Abdel-Salam, 2004Judpentienë and Mockutë, 2004Sotomayor, Martínez, et al., 2004Vilaseca, Guy, et al., 2004Vinogradov, 2004
Comment MSDC-RI MSDC-RI MSDC-RI MSDC-RI MSDC-RI
Column type CapillaryCapillaryCapillaryCapillaryCapillary
Active phase SE-30HP-5DB-5CP Sil 5 CBMethyl Silicone
Column length (m)  30. 25.
Carrier gas  He
Substrate
Column diameter (mm)  0.25 0.39
Phase thickness (μm)  0.25
Program not specified60C (4min) => 1C/min => 64C => 2.5C/min => 155C => 5C/min => 250Cnot specifiednot specifiednot specified
I 1346.1366.1361.1342.1343.
ReferenceVinogradov, 2004Jordán, Martínez, et al., 2003Petrakis, Tsitsimpikou, et al., 2001Weyerstahl, Marschall, et al., 1999Zenkevich, 1999
Comment MSDC-RI MSDC-RI MSDC-RI MSDC-RI MSDC-RI
Column type CapillaryCapillaryCapillaryCapillaryCapillary
Active phase DB-5DB-5CP Sil 5 CB5 % Phenyl methyl siloxaneOV-101
Column length (m) 15. 25.
Carrier gas He N2
Substrate
Column diameter (mm) 0.25
Phase thickness (μm) 0.25
Program 40C(5min) => 5C/min => 120C(10min) => 4C/min => 250C(4min) => 5C/min => 280Cnot specifiednot specifiednot specifiednot specified
I 1363.1365.1344.1344.1345.
ReferenceAnitescu, Doneanu, et al., 1997Isidorov, Zenkevich, et al., 1997Weyerstahl, Marschall, et al., 1997Sagrero-Nieves and Bartley, 1995Shibamoto, 1987
Comment MSDC-RI MSDC-RI MSDC-RI MSDC-RI MSDC-RI
Column type Packed
Active phase OV-101
Column length (m) 2.5
Carrier gas N2
Substrate Chromosorb G 60-80mesh DMCS
Column diameter (mm)
Phase thickness (μm)
Program not specified
I 1343.
ReferenceSwigar and Silverstein, 1981
Comment MSDC-RI

Kovats' RI, non-polar column, temperature ramp

Data compiled by: NIST Mass Spectrometry Data Center, William E. Wallace, director

Column type CapillaryCapillaryCapillaryCapillaryCapillary
Active phase DB-1HP-5BP-1BP-5SPB-5
Column length (m) 30.25.25.50.60.
Carrier gas He N2HeHe
Substrate
Column diameter (mm) 0.250.20.320.320.32
Phase thickness (μm) 0.250.330.250.251.
Tstart (C) 50.60.60.50.60.
Tend (C) 280.240.220.260.200.
Heat rate (K/min) 5.3.5.5.4.
Initial hold (min) 3.  2.
Final hold (min)   13.5.30.
I 1347.1368.1353.1369.1376.
ReferenceAllegrone, Belliardo, et al., 2006Oliveira, Leitao, et al., 2006Raina, Verma, et al., 2006Baranauskiene, Venskutonis, et al., 2005Gauvin, Lecomte, et al., 2004
Comment MSDC-RI MSDC-RI MSDC-RI MSDC-RI MSDC-RI
Column type CapillaryCapillaryCapillaryCapillaryCapillary
Active phase SPB-1DB-5CP Sil 5 CBMethyl SiliconeBP-1
Column length (m) 30.50.25.50.60.
Carrier gas HeHeHeHeN2
Substrate
Column diameter (mm) 0.320.320.250.250.32
Phase thickness (μm) 0.250.250.150.250.25
Tstart (C) 50.50.50.70.60.
Tend (C) 250.280.230.240.220.
Heat rate (K/min) 2.5.3.4.5.
Initial hold (min) 2.2.
Final hold (min) 5.10.
I 1351.1366.1342.1352.1346.
ReferenceYadav, Chauhan, et al., 2004Baranauskiene, Venskutonis, et al., 2003Ogunwande, Olawore, et al., 2003Palá-Paúl, Pérez-Alonso, et al., 2002Raina, Lal, et al., 2002
Comment MSDC-RI MSDC-RI MSDC-RI MSDC-RI MSDC-RI
Column type CapillaryCapillaryCapillaryCapillaryCapillary
Active phase BP-1Cross-Linked MethylsiliconeHP-5MSDB-5BP-1
Column length (m) 25.50.30.30.50.
Carrier gas N2HeHeHe
Substrate
Column diameter (mm) 0.320.20.250.260.25
Phase thickness (μm) 0.250.250.250.250.25
Tstart (C) 60.100.60.60.60.
Tend (C) 220.280.280.246.260.
Heat rate (K/min) 5.4.3.3.2.
Initial hold (min)
Final hold (min) 15.
I 1328.1343.1365.1365.1342.
ReferenceRaina, Srivastava, et al., 2002Rajeswara Rao, Kaul, et al., 2002Roussis, Tsoukatou, et al., 2000Adams, 1999Vera and Chane-Ming, 1999
Comment MSDC-RI MSDC-RI MSDC-RI MSDC-RI MSDC-RI
Column type CapillaryCapillaryCapillaryCapillaryCapillary
Active phase BP-1Methyl SiliconeMethyl SiliconeOV-1SE-30
Column length (m) 50.30.25.30.25.
Carrier gas  HeN2HeN2
Substrate
Column diameter (mm) 0.250.320.50.310.2
Phase thickness (μm) 0.250.25 3.
Tstart (C) 60.60.60.70.60.
Tend (C) 260.250.220.280.180.
Heat rate (K/min) 2.2.5.10.3.
Initial hold (min)  2.  10.
Final hold (min)  5.  1.
I 1345.1345.1342.1375.1340.
ReferenceVera and Chane-Ming, 1999Adegoke, Rao, et al., 1998Mallavarapu, Rao, et al., 1998Afsharypuor, Asgary, et al., 1996Jantan, Ahmad, et al., 1996
Comment MSDC-RI MSDC-RI MSDC-RI MSDC-RI MSDC-RI
Column type CapillaryCapillaryCapillaryCapillary
Active phase DB-5SPB-1OV-101OV-101
Column length (m) 30.50.70.70.
Carrier gas  HeN2N2
Substrate
Column diameter (mm)  0.200.280.28
Phase thickness (μm)
Tstart (C) 40.35.80.80.
Tend (C) 210.200.200.200.
Heat rate (K/min) 2.3.2.2.
Initial hold (min) 2.5.
Final hold (min) 120.20.
I 1368.1343.1337.1344.
ReferenceLoayza, Abujder, et al., 1995Wong and Tie, 1993Yamaguchi and Shibamoto, 1981Yamaguchi and Shibamoto, 1981
Comment MSDC-RI MSDC-RI MSDC-RI MSDC-RI

Kovats' RI, polar column, isothermal

Data compiled by: NIST Mass Spectrometry Data Center, William E. Wallace, director

Column type PackedPacked
Active phase Carbowax 20MCarbowax 20M
Column length (m) 2.52.5
Carrier gas N2N2
Substrate EmbacelEmbacel
Column diameter (mm)
Phase thickness (μm)
Temperature (C) 150.150.
I 1735.1735.
Referenceter Heide, 1968ter Heide, 1968
Comment MSDC-RI MSDC-RI

Kovats' RI, non-polar column, custom temperature program

Data compiled by: NIST Mass Spectrometry Data Center, William E. Wallace, director

Column type CapillaryCapillaryCapillaryCapillary
Active phase HP-5SPB-1HP-5BP-1
Column length (m)  30.30.25.
Carrier gas He HeN2
Substrate
Column diameter (mm)  0.250.250.32
Phase thickness (μm)  0.250.250.25
Program 60C(5min) => 3C/min => 100C => 1C/min => 160C => 10C/min => 240C(10min)not specified40C (3min) => 3C/min => 180C => 30C/min => 270C (5min)60C => 5C/min => 220C(5min) => 3C/min => 245C(5min)
I 1362.1345.1362.1340.
Referencede Marchese, de Heluani, et al., 2007Riu-Aumatell, Castellari, et al., 2004Daferera, Ziogas, et al., 2003Raina, Srivastava, et al., 2003
Comment MSDC-RI MSDC-RI MSDC-RI MSDC-RI

References

Weast and Grasselli, 1989
CRC Handbook of Data on Organic Compounds, 2nd Editon, Weast,R.C and Grasselli, J.G., ed(s)., CRC Press, Inc., Boca Raton, FL, 1989, 1. [all data]