Hexanedioic acid, bis(2-methylpropyl) ester
- Formula: C14H26O4
- Molecular weight: 258.3538
- IUPAC Standard InChIKey: RDOFJDLLWVCMRU-UHFFFAOYSA-N
- CAS Registry Number: 141-04-8
- Chemical structure:
View 3d structure (requires JavaScript / HTML 5) - Other names: Adipic acid, diisobutyl ester; Adipic acid bis(2-methylpropyl) ester; Diisobutyl adipate; DIBA; Ftaflex DIBA; Isobutyl adipate; Bis(2-methylpropyl) hexanedioate; Diisobutyl hexanedioate; Hexanedioic acid, diisobutyl ester; Plasthall DIBA; Hexanedioic acid, 1,6-bis(2-methylpropyl) ester; NSC 6343

Kovats' RI, non-polar column, custom temperature program

Column type | Active phase | I | Reference | Comment |
---|---|---|---|---|
Packed | SE-30 | 1660. | Ramsey, Lee, et al., 1980 | He, Chromosorb G HP (80-100 mesh); Column length: 1.5 m; Program: not specified |

Van Den Dool and Kratz RI, non-polar column, temperature ramp

Column type | Active phase | I | Reference | Comment |
---|---|---|---|---|
Capillary | 5 % Phenyl methyl siloxane | 1691. | Guisto, Smith, et al., 1993 | 25. m/0.31 mm/0.31 μm, 50. C @ 1. min, 5. K/min, 250. C @ 10. min |
Capillary | 5 % Phenyl methyl siloxane | 1699. | Guisto, Smith, et al., 1993 | 30. m/0.25 mm/0.5 μm, 50. C @ 1. min, 8. K/min, 300. C @ 10. min |

Normal alkane RI, non-polar column, isothermal

Column type | Active phase | Temperature (C) | I | Reference | Comment |
---|---|---|---|---|---|
Capillary | OV-101 | 150. | 1657. | Lipp, Krasnykh, et al., 2008 | Helium; Column length: 50. m; Column diameter: 0.25 mm |
Capillary | OV-101 | 160. | 1656. | Lipp, Krasnykh, et al., 2008 | Helium; Column length: 50. m; Column diameter: 0.25 mm |
Capillary | OV-101 | 170. | 1656. | Lipp, Krasnykh, et al., 2008 | Helium; Column length: 50. m; Column diameter: 0.25 mm |
Capillary | OV-101 | 180. | 1655. | Lipp, Krasnykh, et al., 2008 | Helium; Column length: 50. m; Column diameter: 0.25 mm |

Normal alkane RI, non-polar column, temperature ramp

Column type | Active phase | I | Reference | Comment |
---|---|---|---|---|
Capillary | Ultra-1 | 1652. | Okumura, 1991 | 25. m/0.32 mm/0.25 μm, He, 3. K/min; Tstart: 80. C; Tend: 260. C |

Normal alkane RI, non-polar column, custom temperature program

Column type | Active phase | I | Reference | Comment |
---|---|---|---|---|
Capillary | HP-5 | 1680. | Zhao, Li, et al., 2008 | 30. m/0.25 mm/0.25 μm; Program: 40 0C (2 min) 5 0C/min -> 80 0C 7 oC/min -> 160 0C 9 0C/min -> 200 0C 20 0C/min -> 280 0C (10 min) |
Capillary | HP-5 | 1699. | Zhao, Li, et al., 2008 | 30. m/0.25 mm/0.25 μm; Program: not specified |
Other | Methyl Silicone | 1660. | Ardrey and Moffat, 1981 | Program: not specified |

Normal alkane RI, polar column, temperature ramp

Column type | Active phase | I | Reference | Comment |
---|---|---|---|---|
Capillary | DB-Wax | 2132. | Zhao, Xu, et al., 2009 | 30. m/0.25 mm/0.25 μm, Helium, 40. C @ 2. min, 3. K/min, 230. C @ 5. min |

Normal alkane RI, polar column, custom temperature program

Column type | Active phase | I | Reference | Comment |
---|---|---|---|---|
Capillary | DB-Wax | 2119. | Tao, Wenlai, et al., 2008 | 30. m/0.32 mm/0.25 μm, Helium; Program: 50 0C 20 0C/min -> 80 0C 3 0C/min -> 230 0C |

References

Ramsey, Lee, et al., 1980
Ramsey, J.D.; Lee, T.D.; Osselton, M.D.; Moffat, A.C.,
Gas-liquid chromatographic retention indices of 296 non-drug substances on SE-30 or OV-1 likely to be encountered in toxicological analyses,
J. Chromatogr., 1980, 184, 2, 185-206, https://doi.org/10.1016/S0021-9673(00)85641-1
. [all data]
Guisto, Smith, et al., 1993
Guisto, R.; Smith, S.R.; Stuart, J.D.,
Gas chromatographic retention indices, mass, and infrared spectra of industrially important adipate esters,
J. Chromatogr. Sci., 1993, 31, 6, 225-230, https://doi.org/10.1093/chromsci/31.6.225
. [all data]
Lipp, Krasnykh, et al., 2008
Lipp, S.V.; Krasnykh, E.L.; Levanova, S.V.,
Retention indices of symmetrical dicarboxylic acid esters,
Rus. J. Anal. Chem., 2008, 63, 4, 349-352, https://doi.org/10.1134/S1061934808040072
. [all data]
Okumura, 1991
Okumura, T.,
retention indices of environmental chemicals on methyl silicone capillary column,
Journal of Environmental Chemistry (Japan), 1991, 1, 2, 333-358, https://doi.org/10.5985/jec.1.333
. [all data]
Zhao, Li, et al., 2008
Zhao, Y.; Li, J.; Xu, Y.; Duan, H.; Fan, W.; Zhao, G.,
EXtraction, preparation and identification of volatile compounds in Changyu XO brandy,
Chinese J. Chromatogr., 2008, 26, 2, 212-222, https://doi.org/10.1016/S1872-2059(08)60014-0
. [all data]
Ardrey and Moffat, 1981
Ardrey, R.E.; Moffat, A.C.,
Gas-liquid chromatographic retention indices of 1318 substances of toxicological interest on SE-30 or OV-1 stationary phase,
J. Chromatogr., 1981, 220, 3, 195-252, https://doi.org/10.1016/S0021-9673(00)81925-1
. [all data]
Zhao, Xu, et al., 2009
Zhao, Y.; Xu, Y.; Li, J.; Fan, W.; Jiang, W.,
Profile of volatile compounds in 11 brandies by headspace solid-phase microextraction followed by gas chromatography-mass spectrometry,
J. Food. Sci., 2009, 74, 2, c90-c99, https://doi.org/10.1111/j.1750-3841.2008.01029.x
. [all data]
Tao, Wenlai, et al., 2008
Tao, L.; Wenlai, F.; Yan, X.,
Characterization of volatile and semi-volatile compounds in Chinese rica wines by headspace solid phase microextraction followed by gas chromatography - mass spectrometry,
J. Inst. Brew., 2008, 114, 2, 172-179, https://doi.org/10.1002/j.2050-0416.2008.tb00323.x
. [all data]