Butanedioic acid, dibutyl ester
- Formula: C12H22O4
- Molecular weight: 230.3007
- IUPAC Standard InChIKey: YUXIBTJKHLUKBD-UHFFFAOYSA-N
- CAS Registry Number: 141-03-7
- Chemical structure:
View 3d structure (requires JavaScript / HTML 5) - Other names: Succinic acid, dibutyl ester; Di-n-butyl succinate; Dibutyl succinate; Succinic acid di-n-butyl ester; Tabatrex; Tabutrex; Butyl butanedioate; B-9; Di-n-butylester kyseliny jantarove; DNBS; ENT 666; Butanedioic acid, 1,4-dibutyl ester; NSC 1502; Dibutyl butanedioate

Condensed phase thermochemistry data

Data compiled by: Eugene S. Domalski and Elizabeth D. Hearing
Quantity | Value | Units | Method | Reference | Comment |
---|---|---|---|---|---|
S°liquid | 548.44 | J/mol*K | N/A | Khodzhayeva, Pulatova, et al., 1989 |
Constant pressure heat capacity of liquid
Cp,liquid (J/mol*K) | Temperature (K) | Reference | Comment |
---|---|---|---|
436.24 | 298.15 | Khodzhayeva, Pulatova, et al., 1989 | T = 90 to 400 K. |

Phase change data

Data compiled as indicated in comments:
TRC - Thermodynamics Research Center, NIST Boulder Laboratories, Chris Muzny director
DH - Eugene S. Domalski and Elizabeth D. Hearing
AC - William E. Acree, Jr., James S. Chickos
Quantity | Value | Units | Method | Reference | Comment |
---|---|---|---|---|---|
Tboil | 408. | K | N/A | Fenton, 1968 | Uncertainty assigned by TRC = 6. K; TRC |
Tboil | 547.7 | K | N/A | Timmermans, 1927 | Uncertainty assigned by TRC = 1. K; source of data not clear; TRC |
Enthalpy of fusion
ΔfusH (kJ/mol) | Temperature (K) | Reference | Comment |
---|---|---|---|
29.211 | 244.13 | Khodzhayeva, Pulatova, et al., 1989 | DH |
29.21 | 244.1 | Domalski and Hearing, 1996 | AC |
Entropy of fusion
ΔfusS (J/mol*K) | Temperature (K) | Reference | Comment |
---|---|---|---|
119.60 | 244.13 | Khodzhayeva, Pulatova, et al., 1989 | DH |

Kovats' RI, non-polar column, isothermal

Column type | Active phase | Temperature (C) | I | Reference | Comment |
---|---|---|---|---|---|
Packed | SE-30 | 220. | 1560. | Zulaïca and Guiochon, 1963 | Column length: 2. m |

Normal alkane RI, non-polar column, isothermal

Column type | Active phase | Temperature (C) | I | Reference | Comment |
---|---|---|---|---|---|
Capillary | OV-101 | 170. | 1529. | Lipp, Krasnykh, et al., 2008 | Helium; Column length: 50. m; Column diameter: 0.25 mm |
Capillary | OV-101 | 180. | 1528. | Lipp, Krasnykh, et al., 2008 | Helium; Column length: 50. m; Column diameter: 0.25 mm |
Capillary | OV-101 | 190. | 1528. | Lipp, Krasnykh, et al., 2008 | Helium; Column length: 50. m; Column diameter: 0.25 mm |
Capillary | OV-101 | 200. | 1528. | Lipp, Krasnykh, et al., 2008 | Helium; Column length: 50. m; Column diameter: 0.25 mm |
Capillary | OV-101 | 220. | 1560. | Lipp, Krasnykh, et al., 2008 | Helium; Column length: 50. m; Column diameter: 0.25 mm |

Normal alkane RI, non-polar column, temperature ramp

Column type | Active phase | I | Reference | Comment |
---|---|---|---|---|
Capillary | Ultra-1 | 1526. | Okumura, 1991 | 25. m/0.32 mm/0.25 μm, He, 3. K/min; Tstart: 80. C; Tend: 260. C |

Normal alkane RI, non-polar column, custom temperature program

Column type | Active phase | I | Reference | Comment |
---|---|---|---|---|
Capillary | SE-30 | 1534. | Vinogradov, 2004 | Program: not specified |

Normal alkane RI, polar column, custom temperature program

Column type | Active phase | I | Reference | Comment |
---|---|---|---|---|
Capillary | Carbowax 20M | 2000. | Vinogradov, 2004 | Program: not specified |

References

Khodzhayeva, Pulatova, et al., 1989
Khodzhayeva, M.G.; Pulatova, M.A.; Nadirova, D.A.; Gabzalilova, N.R.; Ismailov, T.S.,
Thermodynamic properties of dibutyl succinate,
Khim.-Farm. Zhur., 1989, 23(3), 378-380. [all data]
Fenton, 1968
Fenton, D.M.,
, 1968. [all data]
Timmermans, 1927
Timmermans, J.,
The Melting Point of Organic Substances,
Bull. Soc. Chim. Belg., 1927, 36, 502. [all data]
Domalski and Hearing, 1996
Domalski, Eugene S.; Hearing, Elizabeth D.,
Heat Capacities and Entropies of Organic Compounds in the Condensed Phase. Volume III,
J. Phys. Chem. Ref. Data, 1996, 25, 1, 1, https://doi.org/10.1063/1.555985
. [all data]