Manganese, pentacarbonyl(trifluoroacetyl)-
- Formula: C7F3MnO6
- Molecular weight: 292.0046
- CAS Registry Number: 14099-62-8

Gas phase thermochemistry data

Data compiled by: José A. Martinho Simões
Quantity | Value | Units | Method | Reference | Comment |
---|---|---|---|---|---|
ΔfH°gas | -1505.0 ± 7.0 | kJ/mol | Review | Martinho Simões | The enthalpy formation relies on -1382.7 ± 4.8 kJ/mol for the enthalpy of formation of Mn(CO)5(CF3)(g) |
ΔfH°gas | -1503.2 ± 6.5 | kJ/mol | Review | Martinho Simões | |
ΔfH°gas | -1504.1 ± 5.9 | kJ/mol | Review | Martinho Simões | Selected data. Average of the values from Connor, Zafarani-Moattar, et al., 1982 |

Condensed phase thermochemistry data

Data compiled by: José A. Martinho Simões
Quantity | Value | Units | Method | Reference | Comment |
---|---|---|---|---|---|
ΔfH°solid | -1584.0 ± 4.9 | kJ/mol | Review | Martinho Simões | The enthalpy formation relies on -1382.7 ± 4.8 kJ/mol for the enthalpy of formation of Mn(CO)5(CF3)(g) |
ΔfH°solid | -1582.2 ± 4.1 | kJ/mol | Review | Martinho Simões | |
ΔfH°solid | -1583.1 ± 3.2 | kJ/mol | Review | Martinho Simões | Selected data. Average of the values from Connor, Zafarani-Moattar, et al., 1982 |

Phase change data

Data compiled as indicated in comments:
MS - José A. Martinho Simões
AC - William E. Acree, Jr., James S. Chickos
Quantity | Value | Units | Method | Reference | Comment |
---|---|---|---|---|---|
ΔsubH° | 79. ± 5. | kJ/mol | TD-HFC | Connor, Zafarani-Moattar, et al., 1982 | MS |
ΔsubH° | 79. ± 5. | kJ/mol | C | Connor, Zafarani-Moattar, et al., 1982, 2 | AC |

Reaction thermochemistry data

Data compiled by: José A. Martinho Simões
Individual Reactions
C7F3MnO6 (cr) + 1.5 (g) =
(cr) + 6
(g) +
(g)
By formula: C7F3MnO6 (cr) + 1.5Br2 (g) = Br2Mn (cr) + 6CO (g) + CBrF3 (g)
Quantity | Value | Units | Method | Reference | Comment |
---|---|---|---|---|---|
ΔrH° | -161. ± 2. | kJ/mol | HAL-HFC | Connor, Zafarani-Moattar, et al., 1982 |
C7F3MnO6 (cr) = C6F3MnO5 (g) + (g)
By formula: C7F3MnO6 (cr) = C6F3MnO5 (g) + CO (g)
Quantity | Value | Units | Method | Reference | Comment |
---|---|---|---|---|---|
ΔrH° | 90.8 ± 0.9 | kJ/mol | TD-HFC | Connor, Zafarani-Moattar, et al., 1982 |

Gas phase ion energetics data

Data compiled as indicated in comments:
RDSH - Henry M. Rosenstock, Keith Draxl, Bruce W. Steiner, and John T. Herron
Ionization energy determinations
IE (eV) | Method | Reference | Comment |
---|---|---|---|
9.0 | PE | Evans, Green, et al., 1969 | Vertical value; RDSH |

References

Martinho Simões
Martinho Simões, J.A.,
Private communication (see http://webbook.nist.gov/chemistry/om/). [all data]
Connor, Zafarani-Moattar, et al., 1982
Connor, J.A.; Zafarani-Moattar, M.T.; Bickerton, J.; El-Saied, N.I.; Suradi, S.; Carson, R.; Al Takkhin, G.; Skinner, H.A.,
Organomet., 1982, 1, 1166. [all data]
Connor, Zafarani-Moattar, et al., 1982, 2
Connor, Joseph A.; Zafarani-Moattar, Mohamed T.; Bickerton, James; El Saied, Nabila I.; Suradi, Sukiman; Carson, Ronald; Al Takhin, Ghassan; Skinner, Henry A.,
Enthalpy of formation of acyl-, alkyl- and hydridopentacarbonyl-manganese complexes. The enthalpy contributions of manganese-hydrogen and manganese-carbon bonds in these molecules. Thermochemical aspects of models in Fischer-Tropsch reactions,
Organometallics, 1982, 1, 9, 1166-1174, https://doi.org/10.1021/om00069a011
. [all data]