2-(Methylsulphonyl)-2-methylpropane

Condensed phase thermochemistry data

Data compiled by: Hussein Y. Afeefy, Joel F. Liebman, and Stephen E. Stein

Quantity Value Units Method Reference Comment
Δfsolid-556. ± 3.kJ/molCcrBusfield, Mackle, et al., 1961Heat of combustion corrected for constant pressure
Quantity Value Units Method Reference Comment
Δcsolid-3728.9 ± 2.3kJ/molCcrBusfield, Mackle, et al., 1961Heat of combustion corrected for constant pressure

Gas phase thermochemistry data

Data compiled by: Hussein Y. Afeefy, Joel F. Liebman, and Stephen E. Stein

Quantity Value Units Method Reference Comment
Δfgas-473. ± 4.kJ/molCcrBusfield, Mackle, et al., 1961Heat of combustion corrected for constant pressure

Phase change data

Data compiled as indicated in comments:
TRC - Thermodynamics Research Center, NIST Boulder Laboratories, Chris Muzny director
ALS - Hussein Y. Afeefy, Joel F. Liebman, and Stephen E. Stein
AC - William E. Acree, Jr., James S. Chickos

Quantity Value Units Method Reference Comment
Tfus357.KN/AKaldor and Hammond, 1991Uncertainty assigned by TRC = 2. K; TRC
Tfus357.6KN/ABusfield, Ivin, et al., 1961Uncertainty assigned by TRC = 0.5 K; TRC
Tfus357.6KN/ABusfield, Mackle, et al., 1961Uncertainty assigned by TRC = 1. K; TRC
Tfus351.KN/AHu and Chen, 1958Uncertainty assigned by TRC = 4. K; TRC
Tfus350.KN/ARheinboldt, Mott, et al., 1932Uncertainty assigned by TRC = 6. K; TRC
Quantity Value Units Method Reference Comment
Δsub19.7 ± 0.6kcal/molEBusfield, Mackle, et al., 1961, 2Heat of combustion corrected for constant pressure; ALS

Enthalpy of fusion

ΔfusH (kcal/mol) Temperature (K) Reference Comment
5.901357.6Busfield, Ivin, et al., 1961AC

In addition to the Thermodynamics Research Center (TRC) data available from this site, much more physical and chemical property data is available from the following TRC products:

References

Busfield, Mackle, et al., 1961
Busfield, W.K.; Mackle, H.; O'Hare, P.A.G., Studies in the thermochemistry of sulphones. Part 2 - The standard heats of formation of sulphones of the type RSO2CH3, Trans. Faraday Soc., 1961, 57, 1054-1057. [all data]