CAS Reg. No. 140855-94-3

Reaction thermochemistry data

Data compiled by: John E. Bartmess

Individual Reactions

(CAS Reg. No. 140855-94-3 • 4294967295gold) + gold = CAS Reg. No. 140855-94-3

By formula: (CAS Reg. No. 140855-94-3 • 4294967295Au) + Au = CAS Reg. No. 140855-94-3

Quantity Value Units Method Reference Comment
Δr<212. ± 38.kJ/molCIDTSpasov, Shi, et al., 2000gas phase

References

Spasov, Shi, et al., 2000
Spasov, V.A.; Shi, Y.; Ervin, K.M., Time-resolved photodissociation and threshold collision-induced dissociation of anionic gold clusters, Chem. Phys., 2000, 262, 1, 75-91, https://doi.org/10.1016/S0301-0104(00)00165-8 . [all data]