4,5-Tetramethylene-1,2-dithiol-3-thione
- Formula: C7H8S3
- Molecular weight: 188.333
- IUPAC Standard InChIKey: WNPWNYMVKHOGRA-UHFFFAOYSA-N
- CAS Registry Number: 14085-34-8
- Chemical structure:
View 3d structure (requires JavaScript / HTML 5) - Permanent link for this species. Use this link for bookmarking this species for future reference.

Gas phase thermochemistry data

Data compiled by: Hussein Y. Afeefy, Joel F. Liebman, and Stephen E. Stein
Quantity | Value | Units | Method | Reference | Comment |
---|---|---|---|---|---|
ΔfH°gas | 37.2 | kcal/mol | Ccb | Geiseler and Rauh, 1972 | Hf_H2SO4.115H2O=-143.885 Kcal/mol |

Condensed phase thermochemistry data

Data compiled by: Hussein Y. Afeefy, Joel F. Liebman, and Stephen E. Stein
Quantity | Value | Units | Method | Reference | Comment |
---|---|---|---|---|---|
ΔfH°solid | 12.0 ± 2.0 | kcal/mol | Ccb | Geiseler and Rauh, 1972 | Hf_H2SO4.115H2O=-143.885 Kcal/mol |
Quantity | Value | Units | Method | Reference | Comment |
ΔcH°solid | -1375.3 ± 2.0 | kcal/mol | Ccb | Geiseler and Rauh, 1972 | Hf_H2SO4.115H2O=-143.885 Kcal/mol |

Phase change data

Data compiled as indicated in comments:
AC - William E. Acree, Jr., James S. Chickos
ALS - Hussein Y. Afeefy, Joel F. Liebman, and Stephen E. Stein
DRB - Donald R. Burgess, Jr.
Quantity | Value | Units | Method | Reference | Comment |
---|---|---|---|---|---|
ΔsubH° | 25.17 | kcal/mol | N/A | Geiseler and Rauh, 1972, 2 | AC |
ΔsubH° | 25.17 | kcal/mol | V | Geiseler and Rauh, 1972 | Hf_H2SO4.115H2O=-143.885 Kcal/mol; ALS |
ΔsubH° | 25.29 | kcal/mol | N/A | Geiseler and Rauh, 1972 | DRB |
Enthalpy of sublimation
ΔsubH (kcal/mol) | Temperature (K) | Reference | Comment |
---|---|---|---|
24.28 | 342. | Geiseler and Rauh, 1972, 2 | Based on data from 335. to 350. K.; AC |

References

Geiseler and Rauh, 1972
Geiseler, G.; Rauh, H.-J.,
Bildungsenthalpien und Mesomerieenergien von π-Bindungssystemen 3. Mitteilung: Bildungsenthalpie und Verdrillung der S-S-Bindung in Trithionen,
Z. Phys. Chem. (Leipzig), 1972, 249, 376-382. [all data]
Geiseler and Rauh, 1972, 2
Geiseler, G.; Rauh, H.J.,
Z. Phys. Chem. (Leipzig), 1972, 249, 376. [all data]