Cyclohexene, 4,4-dimethyl-
- Formula: C8H14
- Molecular weight: 110.1968
- IUPAC Standard InChIKey: DRORSPJLYCDESA-UHFFFAOYSA-N
- CAS Registry Number: 14072-86-7
- Chemical structure:
View 3d structure (requires JavaScript / HTML 5) - Other names: 4,4-Dimethyl-1-cyclohexene; 4,4-Dimethylcyclohexene; 1-Cyclohexene, 4,4-dimethyl-

Phase change data

Data compiled by: Thermodynamics Research Center, NIST Boulder Laboratories, Chris Muzny director
Quantity | Value | Units | Method | Reference | Comment |
---|---|---|---|---|---|
Tboil | 394. | K | N/A | Hibbit and Linstead, 1936 | Uncertainty assigned by TRC = 5. K |

Reaction thermochemistry data

Data compiled by: Hussein Y. Afeefy, Joel F. Liebman, and Stephen E. Stein
Individual Reactions
By formula: H2 + C8H14 = C8H16
Quantity | Value | Units | Method | Reference | Comment |
---|---|---|---|---|---|
ΔrH° | -111.4 ± 0.50 | kJ/mol | Chyd | Turner, Jarrett, et al., 1973 | liquid phase; solvent: Acetic acid |
By formula: C8H14 = C8H14
Quantity | Value | Units | Method | Reference | Comment |
---|---|---|---|---|---|
ΔrH° | -2. ± 3. | kJ/mol | Kin | Hoboken, Wiering, et al., 1975 | gas phase |

References

Hibbit and Linstead, 1936
Hibbit, D.C.; Linstead, R.P.,
Fused Carbon Rings Part VII. THe Preparation of Cyclic Hydrocarbons from Unsaturated Tertiary Alcohols. The Synthesis of Cis-9-methyloctalin and -decalin and A Proof of the Presence of Angular Methyl,
J. Chem. Soc., 1936, 1936, 470. [all data]
Turner, Jarrett, et al., 1973
Turner, R.B.; Jarrett, A.D.; Goebel, P.; Mallon, B.J.,
Heats of hydrogenation. 9. Cyclic acetylenes and some miscellaneous olefins,
J. Am. Chem. Soc., 1973, 95, 790-792. [all data]
Hoboken, Wiering, et al., 1975
Hoboken, N.J.; Wiering, P.G.; Steinberg, H.,
The effect of pressure on the base-catalysed isomerizations of gem-dimethyl- and isopropyl-cyclohexenes. Part 6,
J. R. Neth. Chem. Soc., 1975, 94, 243-245. [all data]